program: Gaussian 09
title: 000167541
version: EM64L-G09RevD.01
frameworkgroup: C1[X(C10H8O2)]
method: RPBEPBE
basis: SDD
operation: Freq
keyword: #pfreq=noraman
keyword: PBEPBE/SDD
title: #p freq=noraman PBEPBE/SDD
converged: YES YES NO YES
title: Mulliken charges:
elementType: O O C C C C C C C C C C H H H H H H H H
charge: -0.253008 -0.214471 0.304841 0.329289 -0.332599 -0.345134 -0.342504 -0.343888 0.007201 -0.537254 0.134362 -0.425213 0.247256 0.279260 0.245389 0.258363 0.227046 0.227048 0.251332 0.282685
chargesum: 0.00000
title: Mulliken charges with hydrogens summed into heavy atoms:
elementType: O O C C C C C C C C C C
charge: -0.253008 -0.214471 0.304841 0.329289 -0.085343 -0.065874 -0.097115 -0.085525 0.007201 0.168172 0.134362 -0.142529
polarizability: 1.96963448e+02 8.60516378e+00 1.21549387e+02 -2.72234584e-03 -3.47137740e-03 4.86697193e+01
1716.lowfreq: -7.2854 -4.4723 -0.0005 0.0003 0.0004 7.7832 60.8917 74.3108 105.5741
frequency: 60.8885 74.2711 105.5730 137.8822 195.5155 213.1421 253.0021 255.6266 323.1103 342.1535 415.8907 454.0762 491.9356 507.2319 581.9678 622.9336 639.3187 672.7539 682.7694 691.0243 765.9976 781.7929 818.7363 860.4982 961.6482 977.1098 989.0827 996.2664 1010.0895 1113.0310 1113.0625 1156.1187 1173.2783 1238.4253 1260.4546 1298.6569 1379.3106 1432.5600 1438.3544 1469.9461 1471.1736 1495.9991 1516.8602 1576.1941 1618.0898 2108.7540 2969.3014 3061.3856 3133.3315 3141.7726 3152.7634 3166.9557 3175.4129 3417.8307
redmass: 4.5251 4.3701 4.3792 4.4101 4.8818 1.4105 2.5717 4.3254 5.1649 7.2336 2.9672 6.2801 4.5377 2.8432 7.4819 7.0847 1.2967 5.9803 1.7599 2.2026 4.3723 6.2500 1.3366 1.6318 1.3849 7.6426 6.1766 1.3466 2.7158 1.3156 1.2588 1.3184 1.2387 3.0148 4.9579 1.2837 5.2238 4.0011 1.2210 1.0492 1.0781 2.5574 10.4099 7.6267 6.2608 6.0824 1.0327 1.1044 1.0999 1.0885 1.0886 1.0949 1.0971 1.1577
irintensity: 0.5830 0.0619 0.9450 8.8388 2.6190 0.4485 2.1507 10.7889 0.0153 4.7118 0.0427 0.0688 4.8296 9.7735 30.7593 1.5127 61.5011 2.7102 12.2394 60.6050 26.7557 0.4499 10.7666 52.2654 0.3651 85.0267 22.2681 0.2633 28.7153 15.4156 0.1872 13.7120 192.3734 109.7140 394.6836 3.4600 9.4513 56.4288 2.8460 14.9967 39.8168 95.1123 235.0250 22.3406 229.8636 46.2442 63.1831 41.8508 22.3060 2.1492 0.0392 10.9388 6.3678 58.8621
temp: 298.150 k
press: 1.00000 atm
elementType: 8 8 6 6 6 6 6 6 6 6 6 6 1 1 1 1 1 1 1 1
symmnumber: 1
zpe: 388554.9 jmol-1
zpe.correction: 0.147993 hartree
zpe.thermalcorrener: 0.159140 hartree
zpe.thermalcorrenthalpy: 0.160084 hartree
zpe.thermalcorrgfe: 0.110759 hartree
zpe.sumelectzpe: -535.381603 hartree
zpe.sumelectthermal: -535.370456 hartree
zpe.sumelectthermalent: -535.369512 hartree
zpe.sumelectthermalfe: -535.418837 hartree
dipole: 3.9766 -4.4031 -0.0013
dipole: 5.9330
quadrupole: -64.6743 -62.0672 -72.1691
quadrupole: 5.7872 0.0070 0.0048
quadrupole: 1.6292 4.2363 -5.8656 5.7872 0.0070 0.0048
hfenergy: -535.5295958 hartree
pointgroup: C01 [X(C10H8O2)]
dipole: 1.5040692 1.7850461 0.0008444 debye
dipolederiv: -1.9818757 -0.3901638 -0.0004384 -0.3068297 -0.3952173 -0.0000777 -0.0004503 -0.0001076 -0.2950038 -1.0245947 -0.1034233 -0.0001719 -0.5040327 -0.8076352 -0.000149 -0.0000506 0.0000336 -0.3250374 -1.2475351 -0.0691967 -0.0003095 0.0103005 -0.2150064 0.0000198 -0.0003344 0.0000066 -0.0351598 1.8260258 0.2520554 0.0004554 -0.0142761 0.1540023 -0.0000097 0.0004742 0.0000665 0.1301906 0.4725804 0.0654598 0.0001629 0.3010595 0.0881445 0.0000707 0.0000915 -0.0000059 -0.0998693 0.4388736 0.045036 0.0001533 -0.2559279 0.0951055 -0.0000876 0.0001984 -0.0000111 -0.0979094 -0.6603722 0.0036455 -0.0001254 0.4608699 -0.0184275 0.000106 -0.000165 -0.000018 -0.2101902 -0.5289931 -0.1443122 -0.0000795 -0.5037072 -0.0361073 -0.0001602 -0.0000577 -0.0000591 -0.1787535 2.302252 -0.1617173 0.0005405 0.0345641 1.0590166 -0.0000425 0.0003475 -0.0000496 0.2111447 0.6345757 0.1759587 0.0000701 0.609709 0.4651908 0.0001575 0.0000416 0.0000378 0.3182369 -0.3820087 0.2361251 -0.0000438 0.2789114 -0.3430779 0.0000589 0.0003249 -0.0002246 -0.0370897 -0.3233288 -0.005822 -0.0001375 0.1129919 -0.2600476 0.0001515 -0.0006107 0.0004986 -0.2264941 0.0744557 0.0694184 -0.0000347 0.077613 -0.0101116 0.0000312 -0.0000365 0.0000358 0.1455233 0.1057939 -0.0826885 -0.0000092 -0.0186217 0.0197488 0.0000072 -0.0000125 -0.0000072 0.1539034 0.0304064 -0.0746997 -0.000029 -0.0961023 -0.0406935 -0.000005 -0.0000225 -0.0000008 0.1686036 0.0256822 0.0812816 -0.0000486 0.0724666 0.008807 0.000037 -0.000052 0.0000423 0.1705025 0.0639395 0.0381739 0.0802894 -0.1431063 -0.0449553 -0.0884462 0.0062765 -0.1041256 -0.0792217 0.0639949 0.0380865 -0.0801972 -0.1431725 -0.04492 0.0883588 -0.0061571 0.1041456 -0.0793183 -0.1539636 0.0019878 -0.0000911 0.0451384 0.0830483 0.0000218 -0.0000978 0.0000071 0.1269476 0.2640918 0.0247946 0.0000441 -0.0178479 0.2431357 -0.0000424 0.0002926 -0.0002644 0.2389947 unknown
polarizability: 197.4653689|-5.9953505|121.0474555|0.0386301|-0.0065589|48.6697295 unknown
InChI: InChI=1S/C10H8O2/c1-3-10(11)8-4-6-9(12-2)7-5-8/h1,4-7H,2H3
charge 0 multiplicity 1
20 atoms
O  3.46891 -0.124976 0.001005
O  -2.799784 -1.615217 -0.000469
C  -0.74981 -0.322712 -0.000188
C  2.074669 -0.110978 0.000608
C  -0.122468 0.950113 -0.000136
C  0.063346 -1.494152 0.000168
C  1.281143 1.066852 0.000254
C  1.458366 -1.393831 0.000561
C  -2.22845 -0.476586 -0.000598
C  4.17411 1.162654 0.001123
C  -3.043734 0.739788 -0.000754
C  -3.804369 1.713064 -0.000805
H  -0.741115 1.854452 -0.000409
H  -0.433079 -2.470115 0.000125
H  1.741711 2.058827 0.00028
H  2.099856 -2.27982 0.000838
H  3.931616 1.750574 0.906754
H  3.93223 1.750401 -0.904783
H  5.242032 0.901834 0.00151
H  -4.477379 2.552229 0.000416
