program: Gaussian 09
title: 000168089
version: EM64L-G09RevD.01
frameworkgroup: C1[X(C20H22F3NO4)]
method: RPBEPBE
basis: SDD
operation: Freq
keyword: #p
keyword: freq=noraman
keyword: PBEPBE/SDD
title: #p freq=noraman PBEPBE/SDD
converged: YES YES NO NO
title: Mulliken charges:
elementType: F F F O O O O N C C C C C C C C C C C C C C C C C C C C H H H H H H H H H H H H H H H H H H H H H H
charge: -0.172680 -0.151410 -0.172575 -0.303522 -0.303460 -0.247910 -0.247998 -0.453044 -0.403878 0.096606 0.096407 0.448011 0.211123 0.211182 0.112225 -0.368583 0.135892 0.135886 -0.759790 -0.759819 -0.312617 0.229048 -0.244690 -0.251536 -0.214992 -0.214995 -0.679055 -0.679056 0.326963 0.290268 0.236874 0.265632 0.264879 0.190263 0.265738 0.190272 0.264781 0.262494 0.225638 0.233391 0.230148 0.231568 0.231770 0.229968 0.216313 0.223288 0.222673 0.216322 0.222751 0.223235
chargesum: 0.00000
title: Mulliken charges with hydrogens summed into heavy atoms:
elementType: F F F O O O O N C C C C C C C C C C C C C C C C C C C C
charge: -0.172680 -0.151410 -0.172575 -0.303522 -0.303460 -0.247910 -0.247998 -0.162776 -0.076915 0.096606 0.096407 0.448011 0.211123 0.211182 0.112225 -0.131709 0.135892 0.135886 -0.039016 -0.039028 -0.050124 0.229048 -0.019052 -0.018145 0.246724 0.246743 -0.016781 -0.016747
polarizability: 2.83130555e+02 1.15164919e-02 2.70811586e+02 2.38963695e-02 -6.88941856e+00 1.93137690e+02
1716.lowfreq: -8.5903 -7.7891 -5.7879 -0.0008 -0.0003 0.0004 8.9450 10.2051 19.3245
frequency: 7.6797 8.9701 18.7473 32.8668 49.5315 56.6287 65.6573 68.0364 69.8037 83.5038 95.2656 105.5627 117.3685 126.1372 127.5152 141.8507 145.1588 148.1532 181.2784 201.2930 202.2973 226.4851 249.7598 250.4907 278.6686 283.1301 300.5155 308.3270 318.1456 324.4447 348.8340 352.1917 355.2979 370.7351 390.0288 392.2079 438.7655 467.7812 501.8940 523.0265 553.4518 564.6762 578.7889 585.6076 597.3157 611.9833 612.7010 638.7211 640.2566 692.0369 709.8050 727.3383 762.9819 767.4150 768.5798 783.6918 795.1334 797.0985 797.2661 819.8022 838.6479 859.4572 880.3407 948.9718 955.8370 972.8123 977.9204 989.0125 990.4359 1004.3337 1023.4295 1023.9777 1033.3194 1033.9553 1036.6267 1039.2298 1073.3023 1099.0647 1102.7754 1109.9126 1112.9574 1135.9047 1135.9354 1146.3620 1178.3563 1195.2681 1216.9597 1233.5244 1246.6775 1246.7674 1248.6750 1272.1143 1296.8468 1319.2984 1319.6742 1339.7847 1359.3124 1364.8376 1387.8439 1396.5633 1396.9226 1405.1667 1410.1039 1435.8931 1443.8144 1445.9075 1464.2740 1464.3376 1467.9961 1470.4513 1471.7849 1476.5359 1479.5546 1486.2653 1487.4462 1487.5931 1581.1626 1584.1916 1588.7354 1611.9602 1634.6513 1656.3812 2991.5879 2991.6368 2992.1731 2992.7740 3010.5914 3010.6724 3066.6852 3066.7378 3088.0045 3088.2723 3088.7733 3088.8581 3095.1738 3101.6381 3101.6850 3107.6309 3107.7765 3124.6292 3140.3753 3151.2950 3169.3616 3554.2148
redmass: 3.5386 4.0841 5.9200 3.5783 3.4287 7.1948 3.8321 2.9186 3.9702 8.2839 4.1776 4.2419 3.6094 2.2407 1.9314 3.3751 1.3301 1.5302 5.7830 3.8343 5.7598 7.7454 1.2579 1.2632 4.1139 5.4412 5.1103 7.9487 5.5413 2.8180 4.8061 7.3025 4.8491 4.4079 3.4520 7.2360 7.7056 6.1801 3.9270 10.6231 4.4144 4.6400 1.4732 5.7341 3.3040 4.1297 9.0725 4.4996 4.8136 8.6701 6.6805 7.0984 2.5894 1.7288 7.0478 6.7780 3.9199 1.1051 1.1192 4.2185 4.6345 2.4587 1.9165 3.1829 2.0939 1.6024 8.9348 1.3526 5.3490 3.6032 5.3009 2.1261 1.5025 1.7358 4.0970 1.5352 2.8444 2.5736 3.4366 2.2267 2.4854 1.4668 1.4666 3.3179 1.2112 2.1789 2.1386 5.4535 1.1465 1.1370 2.0957 2.1534 2.1928 2.0536 3.1958 1.4758 1.5340 1.7998 3.8625 1.2696 1.2829 1.2216 1.1753 2.1074 1.0488 1.0457 1.0416 1.0415 1.6173 1.0804 1.1426 1.0687 1.1959 2.4319 1.0730 1.0780 11.3668 11.4949 7.1113 5.8604 4.0542 9.4311 1.0359 1.0357 1.0399 1.0401 1.0583 1.0583 1.1058 1.1058 1.0972 1.0975 1.0981 1.0978 1.0832 1.1030 1.1030 1.0969 1.0968 1.0854 1.0895 1.0941 1.1003 1.0775
irintensity: 0.1114 0.0650 0.0712 1.0073 0.6204 0.0054 3.5253 0.0423 2.5645 0.1961 0.6996 1.1801 0.8286 3.5564 0.3361 1.6455 0.2600 1.3695 3.0700 3.1216 0.2138 1.6053 0.6807 1.8946 11.2887 1.6138 0.3918 3.2176 0.5136 3.3606 21.9924 2.0605 0.0220 0.9059 5.8230 1.8431 0.0050 0.8698 0.0479 0.0444 3.5387 0.7420 39.6425 5.4323 15.3424 0.0765 13.0560 10.2964 19.7350 10.5511 11.6954 1.1534 19.8431 78.0326 3.9763 3.0244 9.2077 6.4874 0.9853 7.2027 10.0240 23.8426 32.4437 89.6838 52.0470 11.9149 199.2088 3.3144 400.8789 13.0922 121.6499 150.1425 8.8825 77.7134 23.6565 25.9985 49.2315 17.2800 229.1902 2.5474 63.1267 7.6544 1.5921 0.2300 0.8423 2.6646 730.3089 16.5987 2.6420 0.8538 101.1467 93.0728 21.5367 55.0067 7.8546 5.1742 1.3164 1.4812 5.2551 48.5806 14.1083 112.4656 10.7058 15.4128 9.2404 26.2651 12.7337 13.9843 203.3787 18.7491 156.7465 12.2723 126.3163 8.0813 18.8043 10.9412 0.1726 264.6335 1.4279 6.3974 54.6127 270.8351 37.1222 4.8270 1.5246 73.7519 13.2378 21.2773 2.7459 3.8332 24.7757 59.3783 10.7506 4.4267 10.3513 12.0388 84.6502 2.6056 8.3637 3.7465 9.0152 16.4032 20.3175 41.4921
temp: 298.150 k
press: 1.00000 atm
elementType: 9 9 9 8 8 8 8 7 6 6 6 6 6 6 6 6 6 6 6 6 6 6 6 6 6 6 6 6 1 1 1 1 1 1 1 1 1 1 1 1 1 1 1 1 1 1 1 1 1 1
symmnumber: 1
zpe: 1009453.2 jmol-1
zpe.correction: 0.384480 hartree
zpe.thermalcorrener: 0.413567 hartree
zpe.thermalcorrenthalpy: 0.414511 hartree
zpe.thermalcorrgfe: 0.320252 hartree
zpe.sumelectzpe: -1428.437277 hartree
zpe.sumelectthermal: -1428.408191 hartree
zpe.sumelectthermalent: -1428.407246 hartree
zpe.sumelectthermalfe: -1428.501506 hartree
dipole: 0.0077 -8.6706 4.2501
dipole: 9.6562
quadrupole: -136.7489 -152.3638 -157.2730
quadrupole: 0.0168 0.0047 6.6466
quadrupole: 12.0463 -3.5686 -8.4778 0.0168 0.0047 6.6466
hfenergy: -1428.8217579 hartree
pointgroup: C01 [X(C20H22F3N1O4)]
dipole: -0.0201537 3.2834122 1.9109318 debye
polarizability: 283.1278807|0.1534588|269.4394415|-0.4122521|12.3371509|194.5125088 unknown
InChI: InChI=1S/C20H22F3NO4/c1-5-27-18(25)15-11(3)24-12(4)16(19(26)28-6-2)17(15)13-9-7-8-10-14(13)20(21,22)23/h7-10,17,24H,5-6H2,1-4H3
charge 0 multiplicity 1
50 atoms
F  -1.101414 -4.061849 -0.916089
F  0.012579 -2.342694 -1.857649
F  1.158145 -4.043169 -0.920156
O  3.68809 0.890117 -0.184168
O  -3.702689 0.837379 -0.162213
O  2.504088 -1.015739 -0.809489
O  -2.494693 -1.049471 -0.799067
N  -0.016574 2.659516 0.985149
C  -0.000674 -0.02225 -0.041129
C  1.27161 0.831636 0.123883
C  -1.283765 0.813989 0.130519
C  0.009895 -1.196678 0.969463
C  1.230977 2.103012 0.664472
C  -1.258017 2.08577 0.670944
C  0.019124 -2.5800 0.639286
C  0.010132 -0.850565 2.347012
C  2.496172 0.148862 -0.325881
C  -2.50098 0.1142 -0.313154
C  2.399611 3.024184 0.950672
C  -2.437784 2.990722 0.963302
C  0.027748 -3.558687 1.670717
C  0.021584 -3.189667 -0.74654
C  0.018873 -1.818597 3.368817
C  0.027636 -3.189444 3.027593
C  4.921712 0.181889 -0.640967
C  -4.92871 0.11219 -0.612939
C  6.09604 1.119008 -0.374549
C  -6.115798 1.027915 -0.329385
H  -0.000618 -0.445639 -1.055021
H  -0.022041 3.597325 1.386668
H  0.003055 0.211836 2.615546
H  3.150686 2.527969 1.584592
H  2.921821 3.299799 0.01981
H  2.059409 3.948658 1.453723
H  -3.178554 2.484137 1.60111
H  -2.107673 3.919756 1.464667
H  -2.968643 3.259286 0.035263
H  0.034643 -4.618708 1.397931
H  0.018764 -1.509474 4.420157
H  0.034363 -3.960662 3.804724
H  4.808145 -0.060233 -1.713134
H  5.004108 -0.770187 -0.086284
H  -4.990406 -0.845023 -0.064493
H  -4.820915 -0.120381 -1.687828
H  7.036916 0.638888 -0.700215
H  5.981777 2.066293 -0.929757
H  6.181668 1.351685 0.701205
H  -7.051339 0.535338 -0.651809
H  -6.196722 1.250196 0.748917
H  -6.021357 1.981562 -0.877428
