program: Gaussian 09
title: 000167612
version: EM64L-G09RevD.01
frameworkgroup: C1[X(C15H26N3O)]
method: RPBEPBE
basis: SDD
operation: Freq
keyword: #p
keyword: freq=noraman
keyword: PBEPBE/SDD
title: #p freq=noraman PBEPBE/SDD
converged: NO YES NO NO
title: Mulliken charges:
elementType: O N N N C C C C C C C C C C C C C C C H H H H H H H H H H H H H H H H H H H H H H H H H H
charge: -0.323935 -0.111877 -0.409898 -0.673201 -0.334232 -0.290434 -0.292823 -0.294846 -0.424129 -0.709911 -0.707868 -0.732701 0.193564 0.276288 -0.334779 -0.311684 -0.409022 -0.425973 0.510489 0.250994 0.323652 0.255678 0.258383 0.264733 0.255350 0.245014 0.246786 0.259934 0.245762 0.246485 0.241997 0.263833 0.246149 0.238340 0.266649 0.319820 0.226600 0.254663 0.317468 0.272117 0.189306 0.235094 0.231959 0.326068 0.324140
chargesum: 1.00000
title: Mulliken charges with hydrogens summed into heavy atoms:
elementType: O N N N C C C C C C C C C C C C C C C
charge: -0.323935 -0.111877 -0.092429 -0.022993 0.240414 0.223627 0.227260 0.196954 0.081567 0.042404 0.043270 0.068382 0.193564 0.276288 -0.062662 -0.122378 -0.173928 -0.194014 0.510489
polarizability: 3.04689797e+02 -4.08802874e+00 1.71803444e+02 1.78253794e+01 8.70104770e+00 1.28036995e+02
1716.lowfreq: -21.4965 -6.0331 -0.0008 0.0004 0.0006 2.0583 6.0701 27.6504 41.3457
frequency: -7.3121 27.4050 41.1750 57.0587 76.4036 103.4954 113.4655 116.0471 140.0856 149.3145 164.3901 214.9196 229.0240 235.8195 269.6940 281.2483 299.2148 302.1803 313.6387 337.3886 360.6630 367.5638 374.1370 396.2034 400.0607 436.2502 439.7827 469.4979 475.0162 489.0889 493.8283 516.9963 560.7166 612.2920 634.0322 677.5850 688.6311 741.6411 757.3685 769.0180 791.8133 795.5861 804.0024 816.4780 833.6982 847.9593 865.4961 871.1244 920.3836 933.3956 989.9671 990.1191 1010.3629 1016.2881 1021.9558 1024.9523 1036.7001 1043.3718 1074.5971 1075.6911 1113.6271 1129.9225 1140.9571 1151.0423 1160.5514 1168.3530 1186.8923 1200.6714 1250.0559 1283.5912 1288.1810 1290.0168 1312.4395 1315.3081 1332.0958 1337.7983 1342.9818 1356.1916 1369.0067 1373.5269 1383.5193 1387.5913 1412.7329 1415.7847 1427.3098 1438.6410 1457.5872 1463.6912 1469.1029 1472.5246 1476.1681 1477.8795 1485.0641 1487.2163 1488.6096 1492.3875 1497.3485 1514.1771 1522.0330 1548.6484 1584.7839 1635.1989 1653.1463 2986.2807 3005.0521 3006.8839 3008.5016 3031.7329 3036.6717 3043.2578 3045.7885 3076.9144 3080.9646 3085.7754 3089.4084 3094.7958 3095.3209 3097.5849 3109.1903 3109.7553 3116.9520 3121.8530 3123.6772 3135.2071 3143.7652 3165.8067 3552.8497 3583.7134 3689.9293
redmass: 3.2950 4.1246 5.0114 4.1695 1.7219 2.2545 3.9566 3.6132 4.0633 2.5061 2.7796 1.7852 1.3154 1.6874 2.0248 2.1890 2.7941 2.9633 1.9222 2.0024 3.0840 2.7854 2.9600 3.0818 2.7558 1.0688 2.8050 1.6007 2.7618 1.2246 3.8618 2.0994 2.8524 5.0405 6.9081 3.1840 3.5392 1.5328 4.4943 1.4507 1.3855 1.7948 1.4263 1.7643 3.1549 1.6753 1.7922 2.0534 2.6326 1.4108 1.6790 2.3716 1.9405 2.2310 2.2298 1.7362 2.7639 3.2751 1.9241 1.8206 2.2269 1.7279 1.3114 2.3720 1.9433 2.0136 1.8969 1.1651 1.2947 1.1162 1.2362 1.8062 1.1853 1.4066 1.2585 1.1747 2.6079 1.2551 1.2931 1.2810 1.2545 3.6302 1.2175 1.1868 1.1723 1.4828 2.6395 1.0674 1.1203 1.0748 1.5978 1.0783 1.0567 1.0590 1.0593 1.0647 1.0786 1.0571 3.2460 4.8572 5.5050 3.7064 1.3573 1.0387 1.0377 1.0381 1.0593 1.0603 1.0598 1.0612 1.0587 1.1034 1.1002 1.1010 1.1037 1.0998 1.0975 1.1004 1.0881 1.1035 1.1030 1.1041 1.1079 1.0894 1.0956 1.0957 1.0457 1.0783 1.1040
irintensity: 0.3140 0.4910 9.2326 6.7095 1.2934 0.4249 0.2140 3.1891 11.2088 1.6314 0.1694 0.9217 0.1162 0.2202 1.5791 2.1795 1.8059 11.9610 1.3901 3.7799 0.1266 3.4433 4.8238 5.5552 3.7304 0.4906 3.1064 8.5213 10.2493 393.4268 8.5027 0.8947 5.7077 9.8242 2.4656 2.5037 25.8178 21.1575 17.5237 23.0823 44.7665 9.5134 16.3264 3.1018 0.8387 54.3463 0.7313 0.9453 12.5029 1.1289 1.2753 1.5561 27.4860 7.1507 15.5588 4.9357 28.7350 3.4319 4.4171 4.1800 3.5390 13.0380 31.4009 16.3315 10.7061 8.2552 4.3312 154.6121 48.9280 7.2107 55.1126 198.0759 33.6839 23.2170 7.3512 54.1852 63.0712 9.8920 0.7714 0.9550 25.4792 4.3227 25.4027 34.0108 11.7713 86.9259 6.1352 7.2521 64.7501 61.0043 259.7005 22.3243 5.4385 37.1550 11.1010 14.2837 1.4831 7.1863 122.0491 184.8002 214.3024 185.9210 357.2330 58.5276 4.7705 8.1605 33.9714 11.0759 18.2253 8.9860 10.0268 10.5081 26.2308 10.4289 1.3556 3.0954 9.9506 4.6822 22.3530 18.3112 23.8656 21.6814 8.3472 11.2418 15.4298 5.1090 171.8830 15.4478 30.9747
temp: 298.150 k
press: 1.00000 atm
elementType: 8 7 7 7 6 6 6 6 6 6 6 6 6 6 6 6 6 6 6 1 1 1 1 1 1 1 1 1 1 1 1 1 1 1 1 1 1 1 1 1 1 1 1 1 1
symmnumber: 1
zpe: 1039724.0 jmol-1
zpe.correction: 0.396010 hartree
zpe.thermalcorrener: 0.416090 hartree
zpe.thermalcorrenthalpy: 0.417034 hartree
zpe.thermalcorrgfe: 0.348008 hartree
zpe.sumelectzpe: -824.983158 hartree
zpe.sumelectthermal: -824.963078 hartree
zpe.sumelectthermalent: -824.962133 hartree
zpe.sumelectthermalfe: -825.031159 hartree
dipole: -7.2071 -3.5640 0.5372
dipole: 8.0581
quadrupole: 6.2068 -99.7853 -108.0597
quadrupole: -2.5545 3.8208 4.5119
quadrupole: 73.4196 -32.5726 -40.8470 -2.5545 3.8208 4.5119
hfenergy: -825.3791676 hartree
pointgroup: C01 [X(C15H26N3O1)]
dipole: -2.8170648 -1.4529074 -0.0631449 debye
polarizability: 304.2287267|-5.4533211|167.7817778|19.6427077|15.2909299|132.5197328 unknown
InChI: InChI=1S/C15H26N3O/c1-4-18(5-2,6-3)12-11-17-15(19)13-7-9-14(16)10-8-13/h7-10,17H,4-6,11-12,16H2,1-3H3
charge 1 multiplicity 1
45 atoms
O  0.362306 1.356423 -0.020699
N  -3.495686 -0.089051 0.047288
N  0.202919 -0.795146 -0.829189
N  6.59018 -0.303051 0.597596
C  -2.023557 -0.548353 0.16712
C  -4.264301 -1.110088 -0.829987
C  -4.101379 -0.004157 1.475093
C  -3.599262 1.322651 -0.60824
C  -1.207819 -0.570464 -1.153812
C  -5.776333 -0.88353 -0.948504
C  -4.202692 -1.331917 2.235757
C  -2.7443 2.417024 0.041633
C  0.963796 0.259649 -0.30369
C  2.413004 0.052301 -0.094761
C  3.149884 1.107725 0.516174
C  3.121707 -1.125461 -0.472057
C  4.524291 0.998889 0.748924
C  4.49884 -1.249311 -0.246406
C  5.230762 -0.186822 0.372251
H  -2.04009 -1.554764 0.615379
H  -1.524484 0.149519 0.856872
H  -3.794109 -1.064548 -1.826799
H  -4.052067 -2.103174 -0.399484
H  -3.462715 0.704928 2.025607
H  -5.09677 0.455962 1.358867
H  -4.669589 1.585427 -0.571297
H  -3.320075 1.187803 -1.667053
H  -1.297534 0.401301 -1.671643
H  -1.542844 -1.372826 -1.832733
H  -6.033771 0.072803 -1.432143
H  -6.299365 -0.946979 0.020034
H  -6.186288 -1.685252 -1.588015
H  -3.221593 -1.796589 2.428181
H  -4.858424 -2.067907 1.74119
H  -4.650292 -1.115616 3.22198
H  -1.662926 2.194925 0.016018
H  -3.050726 2.642827 1.077182
H  -2.902944 3.342353 -0.54157
H  0.63786 -1.68129 -1.081099
H  2.607514 2.015871 0.798077
H  2.616727 -1.967423 -0.962907
H  5.067814 1.825727 1.220323
H  5.023571 -2.162398 -0.549934
H  7.115798 0.453013 1.029558
H  7.099762 -1.140701 0.327418
