program: Gaussian 09
title: 000167538
version: EM64L-G09RevD.01
frameworkgroup: C1[X(C3H9NO4S)]
method: RPBEPBE
basis: SDD
operation: Freq
keyword: #p
keyword: freq=noraman
keyword: PBEPBE/SDD
title: #p freq=noraman PBEPBE/SDD
converged: YES YES NO NO
title: Mulliken charges:
elementType: S O O O O N C C C H H H H H H H H H
charge: 1.041537 -0.474218 -0.584063 -0.511293 -0.518942 -0.573001 -0.094254 -0.622474 -0.333983 0.276929 0.336073 0.300799 0.189477 0.237630 0.271957 0.317162 0.362058 0.378605
chargesum: 0.00000
title: Mulliken charges with hydrogens summed into heavy atoms:
elementType: S O O O O N C C C
charge: 1.041537 -0.112160 -0.205458 -0.511293 -0.518942 0.016118 0.182674 0.014399 0.093125
polarizability: 9.54015647e+01 -1.25349347e+00 7.81647533e+01 3.24189153e-02 -3.67258470e-01 6.74377600e+01
1716.lowfreq: -11.4163 -0.0027 -0.0025 -0.0008 4.3345 10.4743 34.6765 56.8273 122.0594
frequency: 34.4008 56.7699 122.0551 140.0640 177.6682 183.9005 209.9533 249.2989 261.1406 284.6178 302.6739 319.5672 343.7634 418.2363 429.6794 472.7256 528.8522 620.7443 648.7555 821.1086 836.4575 892.3868 954.1565 964.2967 993.2142 1020.5349 1045.5716 1081.5831 1144.6346 1176.0205 1203.6164 1236.2633 1270.5596 1327.3953 1378.5311 1395.7985 1409.8314 1473.5139 1649.1108 2949.5241 3034.0554 3047.1612 3059.8328 3149.2113 3469.0781 3494.4782 3593.7614 3594.8473
redmass: 5.5616 4.6067 4.6296 3.5784 3.7623 2.9370 3.1483 1.4977 1.3954 1.3941 4.9803 2.9252 4.8784 2.4320 4.0787 3.6791 9.7900 4.4720 1.4148 3.1379 5.8126 1.5528 9.5081 3.1119 2.7061 1.3213 1.3861 1.3559 1.5519 1.3781 1.3145 1.2561 1.4456 1.3046 1.2204 1.4428 1.0975 1.0774 1.0905 1.0620 1.0972 1.0581 1.0869 1.1108 1.0453 1.0663 1.0955 1.0694
irintensity: 0.5822 0.9845 4.5443 2.7010 3.6559 18.4380 28.0970 61.8251 57.4874 171.8965 39.6861 21.2985 52.4741 4.9742 24.2105 20.8335 104.8642 25.0921 375.0411 7.9330 29.1969 14.7452 78.9713 50.9180 72.6997 40.9905 35.9184 32.7883 3.1250 8.6395 31.8280 3.6651 7.0163 0.7185 0.5710 9.9012 13.9447 5.4478 39.4264 60.6607 26.7182 2.3424 22.3503 1.3937 6.1443 36.5934 8.0211 9.0656
temp: 298.150 k
press: 1.00000 atm
elementType: 16 8 8 8 8 7 6 6 6 1 1 1 1 1 1 1 1 1
symmnumber: 1
zpe: 349736.6 jmol-1
zpe.correction: 0.133208 hartree
zpe.thermalcorrener: 0.145233 hartree
zpe.thermalcorrenthalpy: 0.146178 hartree
zpe.thermalcorrgfe: 0.094994 hartree
zpe.sumelectzpe: -872.478458 hartree
zpe.sumelectthermal: -872.466433 hartree
zpe.sumelectthermalent: -872.465488 hartree
zpe.sumelectthermalfe: -872.516672 hartree
dipole: -3.7135 1.2287 -2.5593
dipole: 4.6744
quadrupole: -51.7914 -67.0555 -64.6882
quadrupole: 9.3917 -2.2378 -1.8596
quadrupole: 9.3870 -5.8771 -3.5098 9.3917 -2.2378 -1.8596
hfenergy: -872.6116659 hartree
pointgroup: C01 [X(C3H9N1O4S1)]
dipole: 1.3263262 0.2190197 1.2549788 debye
dipolederiv: 1.3203671 0.0723585 -0.092091 0.0801253 1.3304312 0.0639358 -0.1665903 0.0330356 1.4788613 -0.4230622 0.1988541 0.1813709 0.2496496 -0.6715445 -0.0417883 0.2414346 -0.0310452 -0.5714354 -0.5558475 0.0053194 0.3368766 0.0499938 -0.5728827 -0.0529416 0.369311 -0.0290865 -0.8643077 -0.6190512 -0.0908795 -0.0649701 -0.0996777 -0.6517192 -0.1180077 -0.0855322 -0.0623265 -0.5098245 -0.6035728 -0.0099186 -0.0551434 -0.0526821 -0.6462804 0.1261313 -0.0515473 0.068094 -0.5382774 -0.5892064 -0.1620576 -0.0075477 -0.2120982 -0.8258002 -0.1790198 0.00451 -0.2048483 -0.2601401 0.090483 -0.107428 -0.1107651 0.2753855 0.5456746 0.1695027 -0.1604503 0.1392369 0.1660878 0.2720611 -0.0157552 0.0396857 -0.0233127 -0.2658849 -0.0552032 0.0136271 -0.0107378 -0.015372 0.3926137 -0.1360321 -0.1351966 -0.3391811 0.4556569 0.0512771 -0.0945443 0.1080982 0.4800654 0.0848376 0.0230125 -0.0264565 -0.023214 0.0312576 0.0079694 0.0125235 0.0064088 -0.0641392 0.1035566 0.0049013 -0.0112648 -0.0204575 0.0063162 -0.0571163 -0.0567932 -0.0478375 0.0693994 -0.0076087 -0.0075502 -0.023742 -0.0065568 0.0940069 0.0032959 0.0156897 0.0430627 -0.0042337 0.0352758 0.0298736 0.0377187 0.0569268 0.007131 0.0259582 -0.0094987 -0.0251013 -0.2256523 -0.0745165 -0.0961825 0.0187745 -0.0715256 -0.1181399 -0.0016965 0.0520537 0.0170916 0.0428287 0.2640232 0.1038751 0.1156138 0.0908067 0.2223079 0.1418038 0.0744192 0.0645219 0.093355 0.1525149 0.186099 -0.0183874 0.0813752 0.3869961 -0.0108366 -0.0181641 0.0041125 0.1315198 0.0418409 0.0119569 -0.0610539 -0.044213 0.3178401 -0.0599389 -0.1059732 -0.0584632 0.34892 0.1152913 -0.0104468 -0.1234218 0.0086558 0.3546331 -0.0133253 -0.0344754 -0.014216 0.2423448 unknown
polarizability: 94.363758|3.6045549|76.6181329|2.3326307|4.8796142|70.0221871 unknown
InChI: InChI=1S/C3H9NO4S/c4-3(1-5)2-9(6,7)8/h3,5-6H,1-2,4H2
charge 0 multiplicity 1
18 atoms
S  -1.440274 -0.637384 -0.508492
O  3.08376 -0.917861 -0.416707
O  -2.092549 -0.346467 1.224514
O  -2.057981 -2.016631 -1.082344
O  -1.639064 0.727007 -1.364451
N  0.597167 1.620271 0.678226
C  1.134296 0.490735 -0.082413
C  0.384197 -0.850355 0.085309
C  2.607555 0.260992 0.32445
H  1.122435 0.766285 -1.151789
H  0.787715 -1.66129 -0.541262
H  0.254607 -1.159604 1.134805
H  2.677589 0.095188 1.42176
H  3.171798 1.176763 0.064741
H  0.397121 1.427142 1.664456
H  -0.176239 2.099848 0.208496
H  4.061383 -1.015301 -0.309244
H  -3.090519 -0.304339 1.171945
