program: Gaussian 09
title: 000167497
version: EM64L-G09RevD.01
frameworkgroup: C1[X(CH4O3)]
method: RPBEPBE
basis: SDD
operation: Freq
keyword: #p
keyword: freq=noraman
keyword: PBEPBE/SDD
title: #p freq=noraman PBEPBE/SDD
converged: YES YES NO NO
title: Mulliken charges:
elementType: O O O C H H H H
charge: -0.183585 -0.424525 -0.378942 -0.201312 0.235245 0.218762 0.362093 0.372264
chargesum: 0.00000
title: Mulliken charges with hydrogens summed into heavy atoms:
elementType: O O O C
charge: -0.183585 -0.062432 -0.006678 0.252695
polarizability: 2.96731124e+01 5.26585838e+00 2.57205961e+01 8.96150693e-01 -1.16847698e+00 1.88664591e+01
1716.lowfreq: -0.0013 -0.0010 -0.0007 1.4265 1.8054 18.4222 136.8111 183.3899 333.7010
frequency: 136.8094 183.3296 333.7003 449.7747 536.5785 788.1475 895.3136 974.5863 1025.9794 1182.1934 1292.8060 1316.9356 1369.0660 1430.8940 2986.8048 3109.5452 3517.0851 3571.9292
redmass: 2.5459 1.4233 1.8394 1.3760 6.7771 5.8570 8.0770 3.1385 1.8098 1.1159 1.2285 1.1975 1.1381 1.0944 1.0627 1.1021 1.0678 1.0655
irintensity: 19.4346 174.8837 32.9004 145.6286 32.0658 35.9098 48.5239 237.2141 3.8404 32.5984 35.6713 5.9875 20.1621 8.4485 58.4149 9.9862 17.7459 12.5802
temp: 298.150 k
press: 1.00000 atm
elementType: 8 8 8 6 1 1 1 1
symmnumber: 1
zpe: 150140.2 jmol-1
zpe.correction: 0.057185 hartree
zpe.thermalcorrener: 0.062380 hartree
zpe.thermalcorrenthalpy: 0.063324 hartree
zpe.thermalcorrgfe: 0.029575 hartree
zpe.sumelectzpe: -265.724947 hartree
zpe.sumelectthermal: -265.719752 hartree
zpe.sumelectthermalent: -265.718808 hartree
zpe.sumelectthermalfe: -265.752557 hartree
dipole: -0.9269 -0.8735 0.4501
dipole: 1.3508
quadrupole: -24.5659 -20.3364 -23.9168
quadrupole: 3.0765 4.4504 0.9990
quadrupole: -1.6262 2.6033 -0.9771 3.0765 4.4504 0.9990
hfenergy: -265.7821322 hartree
pointgroup: C01 [X(C1H4O3)]
dipole: 0.3865456 -0.1226141 -0.3434777 debye
dipolederiv: -0.4424466 -0.1572608 -0.2236081 0.0011257 -0.2896499 0.1366878 -0.2683001 0.0454228 -0.2771114 -0.6464765 -0.0948885 -0.3212565 -0.3162699 -0.7315433 -0.0735272 -0.4287394 -0.0117518 -0.4642313 -0.4971072 -0.0258889 0.0466262 0.003416 -0.2707873 -0.1968727 0.0889635 -0.1854054 -0.2245072 1.0071681 0.2022829 0.285447 0.2751179 0.7502411 0.0669301 0.4865066 0.0730412 0.6019163 0.0184669 0.0454976 0.0448962 0.0045999 0.0601956 -0.0481917 -0.0064242 -0.0787353 -0.0046268 -0.009964 -0.0985066 0.0167608 -0.0550117 -0.088994 0.0713355 -0.0423942 0.1450854 -0.0374169 0.2522306 0.0135259 0.1857421 -0.0110581 0.32463 -0.08179 0.1632244 -0.0851844 0.2146994 0.3181287 0.1152384 -0.0346077 0.0980801 0.2459078 0.1254283 0.0071633 0.0975276 0.1912778 unknown
polarizability: 29.5922293|-4.9756662|21.3545921|-2.6151066|3.1111491|23.3133462 unknown
InChI: InChI=1S/CH4O3/c2-1-4-3/h2-3H,1H2
charge 0 multiplicity 1
8 atoms
O  0.552665 0.307655 0.874175
O  -1.501657 -0.270034 -0.293366
O  1.451744 -0.104736 -0.314343
C  -0.669709 0.779731 0.226298
H  -1.223788 1.244843 1.057569
H  -0.386542 1.518753 -0.550017
H  -1.059656 -0.670331 -1.084628
H  1.975143 -0.823581 0.138012
