program: Gaussian 09
title: 000167502
version: EM64L-G09RevD.01
frameworkgroup: C1[X(C8H10N4S)]
method: RPBEPBE
basis: SDD
operation: Freq
keyword: #p
keyword: freq=noraman
keyword: PBEPBE/SDD
title: #p freq=noraman PBEPBE/SDD
converged: YES YES NO NO
title: Mulliken charges:
elementType: S N N N N C C C C C C C C H H H H H H H H H H
charge: 0.267649 -0.154335 -0.056289 0.051839 0.014255 0.157326 -0.106502 0.182050 -0.244080 -0.610664 -0.760542 -0.440796 -0.829098 0.267322 0.254868 0.228649 0.255030 0.241534 0.251580 0.241559 0.273288 0.242248 0.273107
chargesum: 0.00000
title: Mulliken charges with hydrogens summed into heavy atoms:
elementType: S N N N N C C C C C C C C
charge: 0.267649 -0.154335 -0.056289 0.051839 0.014255 0.157326 -0.106502 0.182050 0.023242 0.127883 -0.025870 -0.440796 -0.040454
polarizability: 1.90140140e+02 -1.24975767e+00 1.50139729e+02 5.57413401e-03 1.34461383e-03 6.45187148e+01
1716.lowfreq: -15.0740 -6.0773 -0.0017 0.0012 0.0015 7.1489 8.8434 26.2238 68.0410
frequency: -11.8154 26.1679 68.0391 97.1054 115.6598 135.1504 135.8126 210.7053 210.7369 250.2470 266.4519 328.7609 340.6519 383.8469 514.7163 534.3301 558.9512 594.1775 633.0792 664.6328 681.5737 703.6688 767.3934 794.4576 824.3912 868.1382 949.2789 977.3193 992.2300 1006.4940 1033.8729 1041.9060 1125.0141 1149.4103 1194.2969 1222.2560 1270.7901 1293.7619 1295.6412 1340.4894 1355.0530 1387.2007 1392.5091 1422.3201 1435.1945 1451.7462 1455.0077 1456.2276 1461.3629 1479.1260 1489.8715 1543.3819 1562.9917 2992.9156 3002.8618 3020.8947 3070.9416 3093.6747 3117.5238 3127.9022 3144.6162 3150.1200 3224.4977
redmass: 1.0268 1.0247 3.5394 3.2689 1.8255 3.3020 1.8295 4.3956 3.1549 3.1358 5.7303 4.8040 8.4262 8.6443 6.3777 5.0079 4.0354 4.6340 4.2348 7.1657 12.1549 6.6970 10.5936 3.2769 1.9012 7.5445 2.9379 1.1802 1.3038 2.8465 1.9121 1.6008 1.3195 3.6310 3.0724 2.6347 5.1376 5.0114 4.8940 1.3778 3.4649 4.7268 1.3140 1.6029 1.0530 1.0568 1.0458 1.2640 1.0398 2.1382 1.0926 8.9155 7.1135 1.0376 1.0334 1.0282 1.0961 1.1024 1.1019 1.0999 1.1039 1.1055 1.0984
irintensity: 0.0316 0.8542 0.7558 2.9822 4.2990 0.1368 0.5648 0.8032 8.5052 0.8178 0.1475 2.0911 0.0656 1.0225 7.6416 9.9100 0.2262 3.4820 16.3729 1.0588 0.8548 10.2296 8.3926 10.3200 11.0573 10.1432 23.5578 8.1839 6.6354 10.5557 41.3395 5.1331 0.6041 42.1328 27.6516 186.6446 1.5391 42.3249 66.1101 13.3257 78.4941 47.4453 24.9558 6.0955 14.0197 42.9373 17.3203 11.7392 16.9797 61.6436 7.5752 136.6570 163.1144 6.8683 38.3197 24.0388 10.5050 15.1085 10.1520 9.6802 11.4412 13.9443 0.3205
temp: 298.150 k
press: 1.00000 atm
elementType: 16 7 7 7 7 6 6 6 6 6 6 6 6 1 1 1 1 1 1 1 1 1 1
symmnumber: 1
zpe: 457210.0 jmol-1
zpe.correction: 0.174142 hartree
zpe.thermalcorrener: 0.186548 hartree
zpe.thermalcorrenthalpy: 0.187492 hartree
zpe.thermalcorrgfe: 0.134057 hartree
zpe.sumelectzpe: -926.970746 hartree
zpe.sumelectthermal: -926.958340 hartree
zpe.sumelectthermalent: -926.957396 hartree
zpe.sumelectthermalfe: -927.010831 hartree
dipole: -1.8499 -4.7982 0.0003
dipole: 5.1425
quadrupole: -83.6822 -72.3290 -84.8692
quadrupole: 2.1944 -0.0158 0.0027
quadrupole: -3.3887 7.9645 -4.5758 2.1944 -0.0158 0.0027
hfenergy: -927.1448877 hartree
pointgroup: C01 [X(C8H10N4S1)]
dipole: -0.8941448 -1.8146599 -0.0293512 debye
dipolederiv: -0.72416 0.2455223 0.0633942 0.1593347 0.0334266 -0.0066817 0.0586 -0.012977 -0.0743148 -0.4890692 0.10937 0.0322654 -0.1999381 -0.7157188 -0.0149898 0.015367 -0.0395095 -0.1443833 -0.3511129 -0.0795147 0.0043971 -0.0292153 -0.5653735 -0.0150118 0.0069874 -0.0115599 -0.2396333 -1.0787855 0.0230621 0.0722768 -0.3695259 -0.4898776 0.0102123 0.0511587 -0.0198513 -0.157347 -1.0601158 0.2889741 0.0825129 0.6847715 -0.7661731 -0.0836362 0.1039996 -0.0534872 -0.1957147 0.6239417 0.1500263 -0.0297694 0.4495995 0.4606612 -0.0167668 -0.0137016 0.006207 0.1334021 0.0128106 0.0672243 0.0044374 -0.2075893 -0.6115893 -0.018258 -0.0103571 -0.0390999 0.0224745 0.7925426 -0.0804672 -0.0589142 -0.0868972 0.9854482 0.055819 -0.0590246 0.055821 0.082865 0.0976607 -0.3320062 -0.0306699 -0.1872751 0.6093792 0.0504795 -0.0232887 0.0616241 -0.0719312 0.1281454 0.0142169 0.0073965 0.1423827 0.5358721 0.0055381 0.0141658 0.0157678 0.2115165 -0.0326565 0.2378212 0.0163167 0.1158081 -0.3040704 -0.0259953 0.0097814 -0.0361355 0.0095083 1.7904966 -0.3882536 -0.1603516 -0.3671218 0.488493 0.0557559 -0.1595526 0.0572987 -0.0113076 0.0390269 -0.0834345 -0.0037204 -0.0729374 0.1174082 0.0100161 -0.0029742 0.0105763 0.0475218 0.0268422 -0.0492047 0.0087025 -0.0783935 0.0556103 -0.0005584 0.0072534 -0.0026477 0.1758901 0.0746496 0.0870062 -0.0926139 -0.0076198 -0.0171101 0.0177995 -0.0641038 0.0744825 -0.0183521 -0.1043557 -0.1122758 0.010074 -0.0116745 0.0539051 -0.0028939 0.0156963 0.0044052 0.1241361 0.0952895 0.0667114 0.0837805 -0.0153717 -0.0057771 -0.013063 0.0460177 -0.0824085 -0.0481393 0.0739751 0.0045574 0.0946576 0.0043883 0.0546359 0.0001995 0.0868295 -0.0500642 -0.0364871 -0.0129675 -0.1462491 0.0024491 -0.0483109 0.0290142 -0.0010203 0.0076052 0.0066433 0.1187983 0.0439138 0.0235655 -0.1052851 0.0148673 0.0487564 0.0057958 -0.0979114 0.055689 -0.0002833 0.0992586 -0.0641279 0.0734514 0.023419 -0.0344037 0.0595575 0.05012 0.0532714 -0.0312764 -0.1228834 0.079252 0.0228545 0.0662231 0.0603486 -0.0087826 0.0222913 -0.0097605 0.125336 0.0775532 -0.0617763 -0.097642 0.0210764 -0.0228654 -0.0635154 -0.0649595 -0.044285 -0.0222785 unknown
polarizability: 188.8613572|-4.327951|150.4119012|-9.7093679|4.9534351|65.5253258 unknown
InChI: InChI=1S/C8H10N4S/c1-5-6-7(12(2)4-9-6)11-8(10-5)13-3/h4H,1-3H3
charge 0 multiplicity 1
23 atoms
S  3.420384 0.036456 -0.42074
N  -1.612831 -1.306911 -0.108911
N  -2.41951 0.844562 0.066576
N  0.807024 -0.815332 -0.266447
N  1.261771 1.599761 -0.170859
C  -0.499696 -0.467131 -0.148482
C  -1.012488 0.86538 -0.03874
C  -0.061049 1.921911 -0.053723
C  -2.731253 -0.461265 0.02031
C  -1.592233 -2.771006 -0.188062
C  -0.446203 3.371909 0.053997
C  1.625727 0.277785 -0.269742
C  3.508697 -1.838136 -0.529962
H  -3.742497 -0.860861 0.075468
H  -1.008089 -3.193299 0.646987
H  -2.625007 -3.15073 -0.135948
H  -1.132905 -3.097877 -1.136178
H  -0.99335 3.560131 0.995861
H  0.454791 4.002148 0.017975
H  -1.130321 3.654655 -0.766897
H  3.085554 -2.286146 0.380049
H  4.580183 -2.075708 -0.621962
H  2.953302 -2.188497 -1.411273
