program: Gaussian 09
title: 000167572
version: EM64L-G09RevD.01
frameworkgroup: C1[X(C9H19O11P)]
method: RPBEPBE
basis: SDD
operation: Freq
keyword: #p
keyword: freq=noraman
keyword: PBEPBE/SDD
title: #p freq=noraman PBEPBE/SDD
converged: NO YES NO NO
title: Mulliken charges:
elementType: P O O O O O O O O O O O C C C C C C C C C H H H H H H H H H H H H H H H H H H H
charge: 1.392347 -0.520459 -0.565768 -0.450497 -0.472055 -0.451496 -0.436801 -0.554504 -0.680103 -0.593019 -0.443095 -0.421546 -0.066239 -0.038010 -0.128824 -0.141650 -0.160715 -0.233016 -0.278032 -0.080071 -0.299384 0.265975 0.292776 0.260611 0.222661 0.211296 0.298722 0.402483 0.370948 0.371181 0.366331 0.339539 0.233906 0.251969 0.196191 0.433035 0.235881 0.171374 0.366679 0.331382
chargesum: 0.00000
title: Mulliken charges with hydrogens summed into heavy atoms:
elementType: P O O O O O O O O O O O C C C C C C C C C
charge: 1.392347 -0.520459 -0.163285 -0.079549 -0.100874 -0.085165 -0.097262 -0.554504 -0.247068 -0.593019 -0.076417 -0.090165 0.199737 0.254766 0.131787 0.081011 0.050581 0.065705 0.207843 0.116120 0.107870
polarizability: 2.01120551e+02 -4.19525138e-01 1.42782527e+02 -3.07516066e+00 3.13966009e-01 1.36127373e+02
1716.lowfreq: -10.0873 -6.2024 -0.0004 0.0010 0.0012 3.9355 11.6352 20.0300 21.8859
frequency: 10.0265 19.9674 21.0412 50.7650 61.1565 75.0016 93.5242 101.0723 103.0901 129.6341 137.7421 154.3701 187.9569 199.0606 203.9312 207.9455 227.7222 233.2825 247.1765 248.2042 289.1309 313.6781 318.5097 332.3733 341.3814 342.6906 374.4234 395.0771 400.7739 407.4947 417.1251 432.5806 443.2377 444.4435 460.7008 471.5529 480.9604 498.2890 538.2503 545.1524 577.7873 633.5101 685.6471 698.8869 732.7998 775.3612 810.7120 842.6219 864.8712 910.8036 919.5673 932.9975 948.6166 957.0016 973.6148 988.8532 1009.8724 1031.2874 1045.8832 1053.6748 1056.4573 1062.5530 1077.1874 1082.4025 1093.4844 1099.0507 1106.4373 1152.0116 1158.2895 1173.1066 1202.3021 1208.3420 1234.6334 1235.0464 1256.2192 1259.1815 1272.6319 1280.9639 1292.5137 1308.0549 1324.8154 1333.9677 1340.5860 1349.3978 1355.7713 1356.6540 1367.6850 1371.9891 1375.2936 1385.5355 1393.1827 1402.5545 1406.7464 1452.8130 1462.9686 2917.8092 2918.0206 2934.1898 2938.2531 2941.3245 2967.3359 3010.6003 3017.7757 3050.2933 3083.5196 3086.8546 3091.0918 3514.7460 3528.9546 3540.0516 3545.1276 3549.5007 3557.4264 3560.8976
redmass: 7.1945 5.9213 4.0828 7.6969 3.4279 5.3896 3.0354 5.8197 6.8802 5.1973 8.2645 6.0588 8.1873 1.9318 3.2769 4.6244 6.2539 3.9164 4.7103 4.6666 4.2863 3.7277 5.9320 4.9639 1.7166 4.0077 5.8070 2.5542 4.6274 3.0202 1.6543 2.9540 1.6207 1.8620 1.3178 1.7458 2.1284 1.2750 3.0193 3.6123 3.0746 6.1393 4.4535 6.1699 8.1428 7.2829 1.1482 3.4135 3.9023 3.8025 1.5201 8.9244 5.7493 7.0289 3.8013 3.0165 3.4691 2.4047 2.9475 5.4445 3.0896 2.2270 6.8170 3.5079 2.8362 3.2439 2.8505 1.2052 1.1271 1.3712 1.2228 1.1797 1.1615 1.2439 1.2334 1.0945 1.2368 1.2269 1.2345 1.2095 1.2469 1.3909 1.2294 1.3329 1.2630 1.3243 1.4456 1.5564 1.3057 1.1989 1.5152 1.4819 1.4464 1.0829 1.0896 1.0827 1.0820 1.0821 1.0697 1.0687 1.0834 1.0554 1.0866 1.0855 1.0983 1.0852 1.1042 1.0658 1.0652 1.0651 1.0658 1.0655 1.0660 1.0662
irintensity: 0.5922 3.1977 2.2914 3.5447 3.6379 5.8070 13.8545 5.5724 14.5391 4.7925 6.5250 1.5087 5.4349 101.5629 21.0449 21.1701 9.3986 14.1978 7.5934 16.9170 2.5704 5.4688 11.3160 12.4898 6.8632 1.3242 15.4684 27.1930 24.5049 49.3124 138.5134 19.9270 355.8361 21.4894 66.7148 93.2454 125.9480 106.3306 9.3494 77.8490 1.8603 8.8933 39.7144 10.7058 235.4313 106.6984 140.1544 45.6820 10.3030 159.5877 28.2942 335.5757 7.6285 73.9729 11.3359 173.2333 47.7145 42.5003 76.6435 4.8273 107.6438 25.2607 171.8396 12.4684 69.0785 21.9566 5.2059 39.8846 55.4977 21.7689 18.1314 9.5753 14.3882 51.1719 10.0385 17.1537 33.0633 19.1048 40.2892 44.8091 59.3833 79.8824 48.4738 37.3310 3.5821 15.7992 3.2381 58.3352 38.3332 9.7005 3.9547 10.7582 53.6047 4.0507 11.9045 67.1651 15.9514 64.2302 50.4075 1016.0763 39.5806 22.6097 32.5571 6.8064 1.8573 4.5352 32.7284 10.5061 15.1168 24.7206 18.4520 57.2531 29.5900 7.9431
temp: 298.150 k
press: 1.00000 atm
elementType: 15 8 8 8 8 8 8 8 8 8 8 8 6 6 6 6 6 6 6 6 6 1 1 1 1 1 1 1 1 1 1 1 1 1 1 1 1 1 1 1
symmnumber: 1
zpe: 797906.0 jmol-1
zpe.correction: 0.303906 hartree
zpe.thermalcorrener: 0.328297 hartree
zpe.thermalcorrenthalpy: 0.329241 hartree
zpe.thermalcorrgfe: 0.247750 hartree
zpe.sumelectzpe: -1521.274129 hartree
zpe.sumelectthermal: -1521.249739 hartree
zpe.sumelectthermalent: -1521.248795 hartree
zpe.sumelectthermalfe: -1521.330286 hartree
dipole: -9.6800 -1.8586 -1.8878
dipole: 10.0359
quadrupole: -124.3777 -140.7538 -139.7750
quadrupole: -13.0297 -7.8310 8.1646
quadrupole: 10.5912 -5.7850 -4.8062 -13.0297 -7.8310 8.1646
hfenergy: -1521.5780358 hartree
pointgroup: C01 [X(C9H19O11P1)]
dipole: -3.71732 -1.2024747 0.5707598 debye
polarizability: 201.1821976|2.2690534|136.5449502|-0.5885536|-1.7930393|142.3033032 unknown
InChI: InChI=1S/C9H19O11P/c10-1-3(11)2-19-21(17,18)20-9-7(15)5(13)4(12)6(14)8(9)16/h3-17H,1-2H2
charge 0 multiplicity 1
40 atoms
P  1.197954 0.859652 1.639605
O  0.24988 0.343771 0.244498
O  -1.14958 -1.343896 2.204849
O  -1.468151 -0.38735 -1.914666
O  -3.655505 -2.293938 1.515402
O  -3.871971 0.961332 -2.216183
O  -5.399046 -0.565325 -0.164276
O  2.737726 1.008063 0.926911
O  1.320384 -0.570586 2.55277
O  0.668856 2.180765 2.328936
O  4.691726 1.549907 -0.924169
O  6.963943 -0.432665 -1.081652
C  -1.209446 0.339824 0.394562
C  -1.726989 -1.027252 0.881353
C  -1.83304 0.67138 -0.973393
C  -3.256776 -0.970234 1.030998
C  -3.377178 0.724901 -0.858758
C  -3.925156 -0.605025 -0.302687
C  3.367225 -0.163496 0.242567
C  4.774067 0.334156 -0.117324
C  5.539866 -0.727474 -0.92188
H  -1.505475 1.127848 1.121005
H  -1.448441 -1.812634 0.155012
H  -1.456327 1.655051 -1.314984
H  -3.513888 -0.19934 1.796011
H  -3.677096 1.561206 -0.18531
H  -3.756765 -1.409504 -1.037839
H  -1.670358 -2.09651 2.587578
H  -1.92101 -0.172452 -2.771948
H  -4.638271 -2.388783 1.424066
H  -4.835508 0.725943 -2.246283
H  -5.648753 0.165462 0.462019
H  3.387087 -1.023565 0.935731
H  2.775973 -0.399582 -0.660732
H  5.312941 0.543182 0.837243
H  0.407214 -1.044321 2.567698
H  5.140309 -0.764692 -1.948418
H  5.397968 -1.719837 -0.437456
H  4.073437 2.170628 -0.455328
H  7.336776 -0.141008 -0.211331
