program: Gaussian 09
title: 000167491
version: EM64L-G09RevD.01
frameworkgroup: C1[X(C9H8N2O3)]
method: RPBEPBE
basis: SDD
operation: Freq
keyword: #pfreq=noraman
keyword: PBEPBE/SDD
title: #p freq=noraman PBEPBE/SDD
converged: YES YES NO NO
title: Mulliken charges:
elementType: O O O N N C C C C C C C C C H H H H H H H H
charge: -0.408142 -0.172669 -0.215104 -0.413991 -0.402845 0.003285 0.433207 0.144928 0.174361 -0.395822 -0.341224 -0.224737 -0.219052 -0.232182 0.343463 0.355511 0.246576 0.273443 0.358199 0.230483 0.230100 0.232212
chargesum: 0.00000
title: Mulliken charges with hydrogens summed into heavy atoms:
elementType: O O O N N C C C C C C C C C
charge: -0.049943 -0.172669 -0.215104 -0.070528 -0.047334 0.003285 0.433207 0.144928 0.174361 -0.149246 -0.067781 0.005746 0.011048 0.000030
polarizability: 1.51426624e+02 1.11307956e+01 1.17519392e+02 2.09623598e+00 -3.30745880e+00 7.34787878e+01
1716.lowfreq: -6.4281 -2.4304 -0.0007 -0.0003 0.0006 7.0718 35.2931 56.3135 85.2303
frequency: 35.1811 56.3002 85.2254 150.0547 212.6716 221.6166 265.3923 312.7470 318.0039 364.0059 392.8675 403.9584 483.3094 505.9761 556.6001 593.9242 615.3073 619.3862 646.5365 663.5558 695.2296 704.8786 723.8934 725.8480 781.8848 858.6056 902.4656 933.0138 968.2116 984.0766 990.1619 1001.5669 1013.4561 1027.1929 1065.4529 1097.5240 1161.6465 1174.8717 1190.1586 1197.8305 1298.1945 1308.5878 1314.9625 1320.0957 1367.1762 1386.2935 1436.7795 1481.7121 1595.5102 1612.0309 1690.0258 1725.4535 3127.7975 3136.5271 3149.3237 3164.3366 3184.4738 3543.3960 3582.8968 3600.4756
redmass: 4.2698 7.7665 6.2925 7.4496 4.2180 5.5014 4.4283 1.3838 6.6438 5.6187 7.2665 2.8234 3.3657 3.8040 1.4058 8.2701 6.3579 4.7277 1.4040 3.9225 5.7188 2.1079 4.5863 4.7797 2.1385 1.2440 3.9835 1.4741 3.4109 1.3812 6.1307 1.4051 5.0032 2.2774 3.2084 1.8439 1.9972 1.0566 1.1856 4.8744 2.3269 1.9991 2.3905 1.3629 1.7469 9.6094 2.2146 2.2999 6.3591 6.1296 8.7386 9.7663 1.0852 1.0888 1.0939 1.0991 1.0962 1.0661 1.0803 1.0803
irintensity: 0.1275 0.1797 0.8305 3.9932 5.0532 0.9131 8.5082 81.4021 0.8232 12.1676 19.7712 0.1596 26.5928 7.3649 77.5843 6.8530 0.1444 11.5868 118.0522 77.4047 4.9629 44.2925 50.9770 42.3193 46.7286 0.0606 65.3955 13.9440 24.5802 0.1165 1.1849 7.4797 97.3501 10.8117 12.9555 5.9385 44.1884 0.6774 16.5598 132.2977 87.9251 124.9234 79.4140 9.3068 39.6355 0.5609 23.4852 9.8333 0.2987 1.1917 543.3794 359.1306 0.6931 4.2586 27.0892 23.5496 3.9103 11.8125 75.8369 51.5365
temp: 298.150 k
press: 1.00000 atm
elementType: 8 8 8 7 7 6 6 6 6 6 6 6 6 6 1 1 1 1 1 1 1 1
symmnumber: 1
zpe: 423039.2 jmol-1
zpe.correction: 0.161127 hartree
zpe.thermalcorrener: 0.172841 hartree
zpe.thermalcorrenthalpy: 0.173785 hartree
zpe.thermalcorrgfe: 0.122588 hartree
zpe.sumelectzpe: -681.964287 hartree
zpe.sumelectthermal: -681.952574 hartree
zpe.sumelectthermalent: -681.951630 hartree
zpe.sumelectthermalfe: -682.002827 hartree
dipole: -0.9652 0.4245 0.8360
dipole: 1.3456
quadrupole: -77.4526 -83.3933 -81.0926
quadrupole: -10.2736 0.4570 -4.9524
quadrupole: 3.1936 -2.7472 -0.4464 -10.2736 0.4570 -4.9524
hfenergy: -682.1254145 hartree
pointgroup: C01 [X(C9H8N2O3)]
dipole: -0.3772999 -0.1833067 -0.3229631 debye
dipolederiv: -0.2852259 0.0069205 0.1061483 0.1288119 -0.6466171 0.1618541 0.0794983 0.2330964 -0.694663 -0.487166 0.1267248 0.0178192 0.1630516 -0.8577511 -0.304196 -0.0456653 -0.3765082 -0.5527099 -1.0159186 0.4268136 -0.0739691 0.5773533 -0.805223 -0.0426158 -0.0578541 -0.0730731 -0.4611001 -1.1643216 0.1723827 -0.2864788 0.1740577 -0.5483902 0.2176632 -0.1896893 0.0764595 -0.6803523 -0.8237622 0.479686 0.1558096 0.3972594 -1.0021236 -0.384023 -0.0922314 -0.2264 -0.5621321 0.7655703 -0.104726 -0.2069394 -0.332187 0.7504446 -0.404696 -0.4158902 -0.3141513 0.4894021 0.0626334 0.0496557 0.0696968 0.0637615 -0.07854 0.0278783 -0.0066435 -0.0060058 -0.1269527 0.94385 -0.589351 0.014404 -0.4981185 1.0751745 0.4451048 0.5098504 0.3864054 0.5017588 1.5669317 -0.6286216 0.391345 -0.8102168 1.2481877 0.4032949 0.400062 0.4380709 1.0783112 -0.0516164 -0.0865874 -0.0017105 0.020681 -0.0384222 -0.0488778 -0.0158394 -0.0271612 -0.128053 -0.1082208 0.0823698 -0.0503156 -0.0474734 0.0369175 -0.0407454 -0.0079754 -0.0543297 -0.0628452 -0.1009905 0.0414664 -0.0214447 0.0558453 0.0942788 -0.0827128 -0.0219336 -0.087663 -0.1115338 0.0301324 -0.1429793 0.013343 -0.1198965 0.0013824 -0.0363281 0.0243666 -0.0236095 -0.1331939 0.088822 0.032474 -0.055177 0.0272209 -0.038202 -0.0392796 -0.0486451 -0.0419915 -0.1298971 0.2599718 0.0545299 -0.0734917 0.086851 0.2088333 -0.0546503 -0.0977444 -0.0310526 0.2815474 0.2602474 0.0669645 -0.0461196 0.1147252 0.2275412 -0.0562409 -0.022505 -0.0698828 0.2701363 0.0121284 0.1036074 -0.0125109 0.1069296 0.0359813 0.0328815 -0.0271781 0.0221563 0.1289855 0.1327007 -0.0254982 0.0147731 -0.0335459 0.0055672 0.0443908 -0.0022666 0.0388177 0.1275026 0.0035149 -0.0816767 -0.0171378 -0.0789292 0.3185418 0.0094134 -0.0423514 -0.0138186 0.355236 0.0632482 -0.03109 0.0216706 -0.0525004 -0.0777758 0.083559 0.0332345 0.0828553 0.1263326 -0.0433608 0.0952045 -0.0102894 0.1085066 0.0047712 0.0369431 -0.002693 0.037739 0.1429475 -0.1091683 -0.04827 0.0505749 -0.0521873 0.0854236 0.0313825 0.0500941 0.0300467 0.1412733 unknown
polarizability: 151.1512149|-11.5993414|117.1945208|-0.2652543|-6.3338151|74.079068 unknown
InChI: InChI=1S/C9H8N2O3/c12-7-9(14,11-8(13)10-7)6-4-2-1-3-5-6/h1-5,10-11,14H
charge 0 multiplicity 1
22 atoms
O  0.545151 1.424242 -1.668778
O  0.947855 2.055866 1.321906
O  3.428942 -1.726633 -0.00616
N  1.475268 -0.691664 -0.899464
N  2.381165 0.19861 0.950435
C  0.585058 0.43689 -0.595779
C  -0.861083 0.030861 -0.314596
C  1.289759 1.033046 0.693805
C  2.529839 -0.857382 -0.006747
C  -1.162962 -1.263217 0.174177
C  -1.896728 0.982045 -0.478198
C  -2.497519 -1.610431 0.480184
C  -3.229341 0.630195 -0.173559
C  -3.53409 -0.665191 0.305798
H  1.318444 -1.330945 -1.677101
H  3.037694 0.322132 1.721897
H  -0.36311 -1.999235 0.313927
H  -1.649219 1.978746 -0.851642
H  1.446632 1.820313 -1.794316
H  -2.726293 -2.614601 0.853485
H  -4.02852 1.367397 -0.307058
H  -4.569041 -0.934945 0.543785
