program: Gaussian 09
title: 000167525
version: EM64L-G09RevD.01
frameworkgroup: C1[X(C19H12O3)]
method: RPBEPBE
basis: SDD
operation: Freq
keyword: #pfreq=noraman
keyword: PBEPBE/SDD
title: #p freq=noraman PBEPBE/SDD
converged: YES YES NO NO
title: Mulliken charges:
elementType: O O O C C C C C C C C C C C C C C C C C C C H H H H H H H H H H H H
charge: -0.273610 -0.228750 -0.189954 0.110929 0.274317 0.265504 0.178488 0.283381 -0.148995 0.282135 -0.261306 -0.421329 -0.416443 -0.397828 0.194220 -0.380911 -0.375340 -0.238850 -0.397872 -0.228476 -0.230282 -0.530731 0.293327 0.284576 0.317330 0.293432 0.290686 0.228233 0.245820 0.239172 0.239982 0.247852 0.225684 0.225608
chargesum: 0.00000
title: Mulliken charges with hydrogens summed into heavy atoms:
elementType: O O O C C C C C C C C C C C C C C C C C C C
charge: -0.273610 -0.228750 -0.189954 0.110929 0.274317 0.265504 0.178488 0.283381 -0.148995 0.282135 -0.261306 -0.128002 -0.131867 -0.080498 0.194220 -0.087479 -0.084654 -0.010617 -0.152052 0.010697 0.009700 0.168413
polarizability: 3.94366305e+02 5.94650859e+00 2.45171088e+02 -2.81049259e-02 -1.47558707e-03 8.41813280e+01
1716.lowfreq: -0.0004 0.0003 0.0004 4.5101 5.8381 11.8199 30.5595 49.7255 71.1287
frequency: 30.5068 49.7217 71.1229 115.5774 121.6561 135.6463 160.1187 182.0070 216.2934 234.5115 265.3231 269.8422 281.7304 301.7786 335.8188 382.2035 413.4941 414.0580 431.2218 462.3303 470.7519 475.4845 506.4468 509.6653 551.9234 588.3277 609.2627 632.5024 646.1534 661.7010 704.4819 710.8662 731.5944 764.0090 767.5542 806.7635 814.3711 818.9485 866.4634 867.2267 895.2482 903.0695 915.5018 945.3224 980.1472 998.1290 1003.7670 1015.2360 1018.3481 1020.2815 1035.3275 1080.0926 1087.6317 1114.3638 1135.0097 1154.4833 1168.5384 1170.0106 1187.5611 1196.2406 1229.6802 1238.8060 1253.1966 1271.2873 1308.7999 1347.1611 1382.3787 1401.0364 1409.2804 1418.5348 1434.0589 1441.5702 1450.6559 1467.2651 1470.8820 1472.8711 1510.3430 1522.1453 1547.6799 1566.0511 1590.1298 1599.4437 1608.6466 1617.8054 2965.7389 3056.3854 3129.7553 3136.3196 3139.6850 3152.2829 3160.0811 3164.5757 3169.9547 3173.0032 3181.1432 3208.2421
redmass: 6.2540 5.6739 4.8006 4.4791 4.9856 4.7300 3.7794 3.6660 5.1531 1.5585 5.6225 4.6906 2.8467 5.0712 6.7775 8.8986 3.4580 7.8980 5.0547 10.4214 3.7968 7.6292 3.8930 6.0174 7.7139 4.3639 5.3938 4.6672 6.7762 7.3009 3.8379 6.6464 2.3096 1.8959 7.1276 1.9226 1.8712 5.1536 6.5763 2.3252 1.5553 1.4344 7.1966 2.3505 6.3230 1.3930 1.3083 1.3628 5.9385 1.3647 2.0506 2.0913 2.3417 1.2589 2.8322 1.3343 1.4771 1.1250 2.1081 1.2969 2.1938 2.2837 1.9186 2.1335 3.6828 4.9257 3.7153 7.2179 5.5166 3.2985 1.7179 2.0844 1.9830 1.0497 2.6087 1.0872 4.3950 8.8550 8.3995 7.4509 6.5544 7.4454 6.9068 7.2850 1.0326 1.1042 1.0999 1.0864 1.0888 1.0905 1.0882 1.0946 1.0938 1.0996 1.0968 1.0941
irintensity: 5.3340 0.3046 0.0623 8.6089 2.8899 2.2397 0.9162 0.4293 0.7463 0.7389 1.8220 0.2804 0.0376 3.6924 0.1633 17.4712 0.0650 8.6497 1.3969 0.5020 2.7556 4.5706 1.1073 0.9225 1.8236 7.0840 16.4747 0.7270 16.8644 1.0201 0.9182 6.1199 46.2924 37.4287 22.5651 54.9359 42.2760 1.9041 19.0670 5.8236 22.3432 1.8847 15.4730 3.0801 32.8274 3.9908 5.3914 0.0308 34.3254 0.0185 9.7377 47.7920 0.1413 0.1084 72.0747 2.6299 19.7178 30.2031 3.7662 13.9476 152.6550 211.6801 24.0798 197.7837 377.1015 12.3734 62.6575 4.1111 40.5362 20.1490 26.4122 3.2476 112.6682 14.5277 17.1570 24.4593 19.5883 51.9296 233.1406 29.3550 67.9167 16.5097 4.8140 20.0127 82.7664 42.3706 21.3969 4.3270 12.7701 8.4873 4.5834 2.6548 19.1147 30.8603 1.7199 25.6603
temp: 298.150 k
press: 1.00000 atm
elementType: 8 8 8 6 6 6 6 6 6 6 6 6 6 6 6 6 6 6 6 6 6 6 1 1 1 1 1 1 1 1 1 1 1 1
symmnumber: 1
zpe: 667520.1 jmol-1
zpe.correction: 0.254245 hartree
zpe.thermalcorrener: 0.271027 hartree
zpe.thermalcorrenthalpy: 0.271971 hartree
zpe.thermalcorrgfe: 0.209658 hartree
zpe.sumelectzpe: -955.427241 hartree
zpe.sumelectthermal: -955.410459 hartree
zpe.sumelectthermalent: -955.409515 hartree
zpe.sumelectthermalfe: -955.471828 hartree
dipole: 2.8384 1.0018 0.0119
dipole: 3.0101
quadrupole: -75.9661 -131.9697 -130.3761
quadrupole: -3.5907 0.0173 0.0168
quadrupole: 36.8046 -19.1991 -17.6055 -3.5907 0.0173 0.0168
hfenergy: -955.6814861 hartree
pointgroup: C01 [X(C19H12O3)]
dipole: 1.1266789 -0.3551436 -0.0831113 debye
polarizability: 393.4851294|-0.5029396|244.7906484|-18.5544869|4.9150652|85.4429439 unknown
InChI: InChI=1S/C19H12O3/c1-22-16-8-4-7-12-11(16)9-10-15-17(12)19(21)14-6-3-2-5-13(14)18(15)20/h2-10H,1H3
charge 0 multiplicity 1
34 atoms
O  4.543596 1.273312 -0.275008
O  -1.004611 -2.472336 -0.054544
O  -2.164844 2.904363 0.174953
C  -0.121714 -0.191563 -0.041213
C  1.28541 -0.561492 -0.137494
C  -0.474617 1.185916 0.021418
C  2.276681 0.502199 -0.163508
C  -2.640432 -0.742257 0.09396
C  -1.216946 -1.214874 -0.00519
C  -2.973152 0.637663 0.154038
C  -1.895388 1.661026 0.120849
C  0.524279 2.202779 -0.0072
C  1.871861 1.869931 -0.097056
C  1.752432 -1.91933 -0.209018
C  3.68026 0.170256 -0.258046
C  -3.675941 -1.708882 0.127217
C  -4.327874 1.041485 0.245942
C  3.117954 -2.195303 -0.300042
C  4.09999 -1.16212 -0.325886
C  -5.02313 -1.304474 0.218534
C  -5.351498 0.074208 0.278008
C  5.981953 1.009898 -0.372884
H  0.189665 3.242712 0.044553
H  2.643829 2.643139 -0.119002
H  1.022698 -2.727282 -0.191208
H  -3.396466 -2.765532 0.079654
H  -4.546594 2.112925 0.290735
H  3.449822 -3.23807 -0.354126
H  5.158978 -1.424389 -0.398112
H  -5.818752 -2.056828 0.243597
H  -6.399201 0.385154 0.34903
H  6.455738 2.002122 -0.369313
H  6.227223 0.479868 -1.313221
H  6.339394 0.420277 0.493083
