program: Gaussian 09
title: 000167505
version: EM64L-G09RevD.01
frameworkgroup: C1[X(C15H16N2O)]
method: RPBEPBE
basis: SDD
operation: Freq
keyword: #p
keyword: freq=noraman
keyword: PBEPBE/SDD
title: #p freq=noraman PBEPBE/SDD
converged: YES YES NO NO
title: Mulliken charges:
elementType: O N N C C C C C C C C C C C C C C C H H H H H H H H H H H H H H H H
charge: -0.256346 -0.331569 -0.441664 -0.247876 -0.440227 -0.433287 -0.394238 0.147827 0.518117 -0.677220 0.421524 0.385687 -0.376368 -0.423003 -0.420740 -0.410850 -0.241822 -0.245909 0.233768 0.218646 0.228350 0.225916 0.222774 0.196194 0.225315 0.299281 0.309396 0.227418 0.309146 0.238436 0.235649 0.241654 0.227516 0.228506
chargesum: 0.00000
title: Mulliken charges with hydrogens summed into heavy atoms:
elementType: O N N C C C C C C C C C C C C C C C
charge: -0.256346 -0.032288 -0.132268 -0.014108 0.006768 0.015404 0.027270 0.147827 0.518117 -0.449802 0.421524 0.385687 -0.067222 -0.184567 -0.185091 -0.169196 -0.014306 -0.017403
polarizability: 3.18719760e+02 1.64790236e+01 1.70888794e+02 -5.51196509e+00 1.00254617e+01 9.26399180e+01
1716.lowfreq: -13.6326 -5.8059 -0.0008 -0.0008 -0.0005 1.6926 14.4446 32.3546 45.5171
frequency: 13.2944 32.0891 45.4957 62.7672 97.0383 130.7707 183.9857 188.9555 222.4562 229.7320 279.4762 312.7352 323.9718 400.9068 405.0681 476.1807 505.5581 512.8968 533.3119 538.2642 561.3140 621.9230 634.8146 646.4564 669.7889 709.4025 716.3732 758.2172 759.7661 782.0202 803.0734 838.2958 860.4258 869.7648 870.8728 886.1415 902.9020 905.1159 924.9470 942.1665 960.7809 976.1656 987.9618 994.2805 1000.8590 1022.9223 1061.7345 1100.2856 1121.6890 1129.8812 1147.5709 1159.9293 1165.3787 1172.4037 1182.6598 1208.8240 1221.8330 1242.7177 1269.4794 1277.5368 1291.8182 1295.8802 1304.0109 1314.2573 1332.7193 1348.2594 1403.0016 1419.4279 1434.5127 1437.6283 1462.1882 1464.3040 1468.8090 1498.7721 1499.2569 1534.6635 1585.7049 1608.1850 1621.2947 1642.9035 2904.0812 2920.2628 3000.2565 3010.4201 3031.2773 3067.8327 3087.5896 3103.4321 3119.0181 3124.7830 3132.2451 3142.2678 3161.9985 3193.8902 3453.3033 3506.9422
redmass: 3.3865 4.1098 3.2707 5.7997 4.4825 4.4186 3.9514 4.7338 3.8898 2.2032 3.5764 5.4210 4.2298 4.0188 3.3780 2.4493 5.8931 6.4536 3.1857 1.9729 2.8011 5.8720 3.8386 1.7018 1.7516 5.5844 2.7766 1.3450 4.7324 2.3619 3.7924 1.2611 3.2429 2.0986 1.6314 2.2885 1.9302 2.1745 2.3134 4.2875 1.3897 2.4608 1.3313 2.4187 1.3414 2.2492 1.7518 2.3427 2.0079 1.6284 1.9829 1.2317 1.4278 1.1280 2.2025 1.5649 1.3803 1.6561 1.2474 1.8000 1.5672 1.4731 1.3730 1.3852 1.3905 1.9702 3.3136 3.7115 2.0815 2.0545 1.1398 2.0497 1.1057 1.3196 1.9304 2.8691 6.5640 5.4616 4.8163 6.6217 1.0831 1.0707 1.0601 1.0666 1.0892 1.1021 1.1054 1.0912 1.0859 1.0888 1.0906 1.0948 1.1003 1.0949 1.0744 1.0757
irintensity: 0.2897 0.5491 0.2321 4.6409 4.0305 2.3794 1.9880 2.2734 1.6297 3.7228 1.8749 36.4535 8.4011 1.8469 0.7413 23.3134 6.0488 3.2155 1.3511 94.5447 25.0119 0.6470 5.9043 44.0533 26.1546 15.7075 27.0196 37.4788 0.1619 2.6899 46.3749 7.1885 3.6649 13.6230 93.2997 1.5413 8.8770 3.6363 1.7705 7.6693 11.1446 8.6928 0.0025 13.9274 0.3725 9.0195 3.0483 18.4902 33.5113 29.5039 46.5029 2.5795 16.5556 4.2332 2.3932 41.2712 1.2671 20.6676 6.6169 7.0138 66.4280 32.8602 26.4504 2.2288 67.2068 77.5882 58.9535 64.0590 60.9851 2.8119 9.8710 2.2247 7.8642 124.3889 287.3521 37.4078 24.6568 95.9173 129.5583 57.8182 96.7678 79.5571 23.0252 18.6138 92.6896 24.4463 49.0031 19.4044 6.1286 0.0817 9.7810 35.0337 39.0592 9.8187 16.6512 8.3857
temp: 298.150 k
press: 1.00000 atm
elementType: 8 7 7 6 6 6 6 6 6 6 6 6 6 6 6 6 6 6 1 1 1 1 1 1 1 1 1 1 1 1 1 1 1 1
symmnumber: 1
zpe: 732657.8 jmol-1
zpe.correction: 0.279055 hartree
zpe.thermalcorrener: 0.294313 hartree
zpe.thermalcorrenthalpy: 0.295258 hartree
zpe.thermalcorrgfe: 0.234066 hartree
zpe.sumelectzpe: -764.652523 hartree
zpe.sumelectthermal: -764.637264 hartree
zpe.sumelectthermalent: -764.636320 hartree
zpe.sumelectthermalfe: -764.697511 hartree
dipole: -0.5562 -3.1610 0.8876
dipole: 3.3300
quadrupole: -96.9056 -98.6301 -112.1696
quadrupole: -6.5326 5.0422 3.2729
quadrupole: 5.6628 3.9384 -9.6012 -6.5326 5.0422 3.2729
hfenergy: -764.9315774 hartree
pointgroup: C01 [X(C15H16N2O1)]
dipole: 0.2335007 -1.2498347 -0.3159193 debye
polarizability: 318.9998904|-15.5192441|170.2429673|0.7299801|-12.1638264|93.0056135 unknown
InChI: InChI=1S/C15H16N2O/c18-15(14-6-3-9-16-14)17-13-8-7-11-4-1-2-5-12(11)10-13/h1-2,4-5,7-8,10,14,16-17H,3,6,9H2
charge 0 multiplicity 1
34 atoms
O  -2.172267 1.69612 -0.001057
N  -4.629496 0.520754 0.627835
N  -1.002695 -0.318233 0.348554
C  -3.459806 -0.362485 0.431284
C  -3.799755 -1.232255 -0.828761
C  -5.347875 -1.197418 -0.858623
C  -5.657165 0.251893 -0.418192
C  -2.157744 0.450903 0.238036
C  0.361166 0.061004 0.188496
C  1.342094 -0.932465 0.336042
C  2.730134 -0.628258 0.185738
C  3.122941 0.732058 -0.124701
C  0.746468 1.412399 -0.117503
C  2.096703 1.722653 -0.266962
C  3.750759 -1.627603 0.330578
C  4.514254 1.039732 -0.278039
C  5.09888 -1.297655 0.175174
C  5.486124 0.046695 -0.131951
H  -3.31926 -1.029398 1.312196
H  -3.388233 -2.254873 -0.766188
H  -3.394513 -0.750992 -1.738734
H  -5.76164 -1.436301 -1.853084
H  -5.763301 -1.912898 -0.125565
H  -5.570245 0.939144 -1.290475
H  -6.67767 0.349683 -0.00578
H  -4.350492 1.508629 0.700448
H  -1.156892 -1.305886 0.571178
H  1.051498 -1.966003 0.569674
H  -0.03108 2.170294 -0.225525
H  2.387517 2.753896 -0.500066
H  3.457685 -2.658056 0.565857
H  4.805661 2.070552 -0.512702
H  5.869423 -2.068403 0.288009
H  6.547421 0.290373 -0.250992
