program: Gaussian 09
title: 000001221
version: EM64L-G09RevD.01
frameworkgroup: C1[X(C7H10N2O4)]
method: RPBEPBE
basis: SDD
operation: Freq
keyword: #p
keyword: freq=noraman
keyword: PBEPBE/SDD
title: #p freq=noraman PBEPBE/SDD
converged: YES YES NO NO
title: Mulliken charges:
elementType: O O O O N N C C C C C C C H H H H H H H H H H
charge: -0.176086 -0.272775 -0.412482 -0.229451 -0.340911 -0.602126 -0.563392 0.093082 -0.132536 0.228023 0.202994 0.183137 -0.758917 0.210226 0.259758 0.246508 0.253692 0.259387 0.239763 0.346332 0.268037 0.310645 0.387091
chargesum: 0.00000
title: Mulliken charges with hydrogens summed into heavy atoms:
elementType: O O O O N N C C C C C C C
charge: -0.176086 -0.272775 -0.025391 -0.229451 0.005421 -0.023444 -0.093408 0.093082 0.113972 0.228023 0.202994 0.183137 -0.006075
polarizability: 1.22268501e+02 6.54101769e+00 1.10128897e+02 1.60303960e+01 1.91740210e+00 7.13874755e+01
1716.lowfreq: -5.0841 -3.1152 -0.0004 -0.0004 0.0007 8.9843 15.8075 33.6628 54.0177
frequency: 15.6141 33.6350 54.0123 88.1158 90.7260 98.6499 141.8373 188.1257 238.0992 264.7560 269.9647 295.4147 328.6944 347.7440 404.2282 460.9581 509.5665 516.6650 539.3335 577.4136 582.5972 609.2560 697.6076 715.4555 724.4505 756.8078 779.2161 866.9137 920.4206 951.0923 997.0863 1045.9456 1052.0988 1063.6057 1114.8499 1120.9144 1166.2353 1184.3307 1207.0776 1276.5812 1284.1663 1311.2557 1321.2973 1354.2434 1398.4854 1406.5849 1453.0722 1455.2805 1468.2979 1607.8782 1638.1889 1667.1734 1673.8019 2990.2020 2991.8411 3006.2771 3058.6909 3073.2403 3108.8777 3484.6954 3519.5137 3616.8602 3626.8957
redmass: 3.1481 5.4977 6.3271 4.9254 2.1050 1.6472 3.4356 4.6688 1.8963 2.4677 1.9050 2.8357 2.5726 2.1903 3.3168 4.9023 4.0429 1.3739 4.4469 3.2585 1.9026 2.8491 4.6991 5.1277 5.5737 5.8299 3.8520 2.5400 1.9764 5.4943 6.1114 1.4920 1.9857 2.6846 2.1221 2.0344 2.8236 3.1701 1.4799 1.6361 1.2722 1.2840 1.4366 3.3935 1.9979 1.3733 1.1077 1.0518 1.0665 1.3118 8.7581 7.6659 4.0331 1.0606 1.0374 1.0853 1.1025 1.0982 1.0982 1.0452 1.0639 1.0840 1.0992
irintensity: 56.9239 0.9697 0.7147 0.8664 3.5274 1.0456 19.5448 4.3493 30.0492 20.7344 15.1173 3.0886 5.6458 53.8373 51.3458 27.1556 23.5814 236.7676 5.0806 18.4484 120.7782 66.9785 69.9168 3.9606 3.3825 11.8377 10.7562 21.8584 7.1124 13.2950 3.5319 2.7676 5.5843 234.5606 8.5644 2.4405 66.6843 21.5875 9.2226 3.5789 4.4477 16.3112 0.0456 14.7592 17.3837 32.5048 15.1196 7.6870 19.6907 180.9030 306.0988 104.1491 119.4191 25.1445 11.7781 31.2899 9.3016 8.7119 10.9153 16.8813 32.1740 83.9214 12.1182
temp: 298.150 k
press: 1.00000 atm
elementType: 8 8 8 8 7 7 6 6 6 6 6 6 6 1 1 1 1 1 1 1 1 1 1
symmnumber: 1
zpe: 453461.9 jmol-1
zpe.correction: 0.172715 hartree
zpe.thermalcorrener: 0.186903 hartree
zpe.thermalcorrenthalpy: 0.187847 hartree
zpe.thermalcorrgfe: 0.129645 hartree
zpe.sumelectzpe: -682.107528 hartree
zpe.sumelectthermal: -682.093339 hartree
zpe.sumelectthermalent: -682.092395 hartree
zpe.sumelectthermalfe: -682.150597 hartree
dipole: 3.8563 3.5265 0.7922
dipole: 5.2853
quadrupole: -78.4233 -69.0547 -76.4095
quadrupole: -3.4217 2.9110 -9.6806
quadrupole: -3.7941 5.5745 -1.7803 -3.4217 2.9110 -9.6806
hfenergy: -682.2802425 hartree
pointgroup: C01 [X(C7H10N2O4)]
dipole: -1.5382022 -1.379318 0.235183 debye
dipolederiv: -0.8477319 0.0662945 0.24426 0.1092596 -0.3540747 0.0304378 0.351131 -0.0124576 -0.1479665 -0.6889343 -0.2676991 0.135155 -0.32952 -0.9513391 0.23919 0.1142536 0.1814619 -0.4380295 -0.6323001 0.1853043 0.2512013 0.266983 -0.3813058 -0.3134003 0.2253925 -0.269623 -0.8188633 -0.8736046 -0.0749599 0.2354615 -0.3562658 -0.5579617 -0.0115472 0.2000202 -0.1038475 -0.4769979 -0.4509331 0.0399549 0.0110561 0.2701861 -0.1481323 -0.1341932 0.0103461 -0.0421972 -0.3806603 -0.8380635 0.2525277 -0.1342842 0.4357509 -0.45818 0.0789515 -0.1693704 0.1448652 -0.5801457 -0.0263027 0.1265188 0.026684 0.0274275 0.0195774 -0.0242871 -0.1448123 0.0781435 0.1046428 -0.0530013 -0.0779211 -0.0034654 -0.378177 -0.5996491 0.1858963 -0.0681926 0.1235363 -0.166563 0.5427975 -0.3885681 -0.0535525 -0.3971137 0.1283221 -0.1306388 -0.0207678 -0.102338 0.2744239 0.7146357 0.0879613 -0.2667841 -0.0304704 0.5844573 -0.044916 -0.3141769 -0.1112198 0.1184659 0.9293972 0.2888396 -0.2849699 0.4096388 1.1904466 -0.3037005 -0.2664744 -0.2079665 0.3848236 1.1872246 0.0886394 -0.5120408 0.3753819 0.8423091 0.400548 -0.4634798 0.3710508 0.8157806 -0.0016885 -0.0626815 0.0405518 0.0052621 -0.170481 0.0186907 0.0574999 0.076859 0.0493727 -0.0062551 -0.0367603 -0.0306969 0.0163246 -0.1228882 -0.1034668 -0.0178744 -0.0722768 0.0394048 0.023051 -0.0015305 0.0601347 -0.0385487 0.0592692 0.0900386 0.0324484 0.0283907 -0.0011922 -0.0483565 -0.0018543 0.0930494 -0.0372646 0.0196796 0.0498031 0.0657148 0.0439018 -0.0684539 -0.0646427 -0.0751806 -0.0669594 -0.0429308 0.0625433 0.0083424 -0.0901301 -0.0266865 0.093004 0.1165267 -0.0107557 0.0039598 -0.0384486 0.0509429 0.0173778 0.0342292 0.060808 -0.0779316 0.012758 0.1085523 0.0647119 0.0620696 0.0336051 -0.0209074 0.0591263 -0.0569017 0.0779211 0.2336315 -0.0512102 0.0744555 -0.044084 0.2235894 0.0286747 0.0742783 0.0366748 0.3705866 0.2119729 -0.1103445 0.0045541 -0.11227 0.1639967 -0.1073775 0.0953312 -0.2022602 0.2231881 0.2684324 -0.0036656 0.0703799 -0.0754742 0.2006355 0.0584269 0.1377775 0.0067194 0.2300974 0.2913869 -0.0814614 0.0371381 -0.0977165 0.1646379 -0.0119429 0.0977296 0.0553632 0.3750922 unknown
polarizability: 123.0029899|6.9510909|110.0491809|-14.8417408|-0.2635967|70.7327024 unknown
InChI: InChI=1S/C7H10N2O4/c1-3-4(6(10)9-13-3)2-5(8)7(11)12/h5,9,11H,2,8H2,1H3
charge 0 multiplicity 1
23 atoms
O  -2.880512 0.027839 0.435014
O  -0.293605 2.16138 -0.823463
O  1.315794 0.904083 1.592913
O  3.168393 0.903835 0.18869
N  -2.307812 1.308947 0.092204
N  2.815537 -1.804219 -0.253924
C  0.538015 -0.862741 -0.914246
C  -0.754778 -0.267453 -0.436364
C  1.655406 -1.044207 0.201855
C  -1.857842 -0.900264 0.082587
C  -1.01487 1.192606 -0.442324
C  2.151529 0.332217 0.638556
C  -2.210602 -2.325429 0.359296
H  0.366172 -1.871214 -1.337011
H  0.96031 -0.231253 -1.717992
H  1.177129 -1.530781 1.072793
H  -3.187336 -2.587501 -0.084896
H  -2.272084 -2.519602 1.445668
H  -1.442281 -2.991201 -0.065763
H  -2.917072 2.107085 0.262385
H  2.618063 -2.680925 -0.737456
H  3.554012 -1.232264 -0.672896
H  1.579737 1.852862 1.738374
