program: Gaussian 09
title: 000013025
version: EM64L-G09RevD.01
frameworkgroup: C1[X(C10H10)]
method: RPBEPBE
basis: SDD
operation: Freq
keyword: #p
keyword: freq=noraman
keyword: PBEPBE/SDD
title: #p freq=noraman PBEPBE/SDD
converged: NO NO NO NO
title: Mulliken charges:
elementType: C C C C C C C C C C H H H H H H H H H H
charge: 0.285568 0.152776 -0.574615 0.317654 -0.422484 -0.407518 -0.398190 -0.806888 -0.238034 -0.234167 0.236378 0.236383 0.240975 0.238898 0.237622 0.231555 0.229652 0.229651 0.222811 0.221972
chargesum: 0.00000
title: Mulliken charges with hydrogens summed into heavy atoms:
elementType: C C C C C C C C C C
charge: 0.285568 0.152776 -0.101854 0.317654 -0.181509 -0.168620 -0.160567 -0.116031 -0.015223 -0.012195
polarizability: 1.36496917e+02 7.79640683e+00 1.19892017e+02 5.13483286e-03 -2.39895849e-03 5.14050816e+01
1716.lowfreq: -0.0006 0.0004 0.0006 9.0228 12.6243 17.3256 144.9181 149.0303 209.4239
frequency: 144.9165 149.0287 209.4205 221.7051 259.8182 412.7874 441.9086 449.7466 519.4792 546.4360 590.7711 671.9168 724.4708 732.7462 760.9006 786.4364 829.1384 865.1196 926.2803 948.4830 953.8424 982.5951 1007.8131 1018.6683 1047.0578 1067.1738 1110.2063 1112.1216 1165.4099 1180.4964 1201.3388 1245.4242 1291.2407 1335.2269 1396.2896 1400.0838 1417.3902 1448.4113 1461.2541 1465.4813 1471.9098 1585.1437 1617.6691 1626.9696 2968.8711 2980.8352 3026.4239 3043.1190 3082.8694 3117.4576 3124.7255 3138.6226 3158.0377 3170.2533
redmass: 2.8887 1.1237 3.1915 2.8960 1.9200 2.8816 3.2017 2.5907 5.1746 5.5983 3.2145 5.1963 1.8733 4.9403 1.5143 1.3046 4.6523 1.3230 1.6954 1.8440 1.6832 1.3166 1.6106 2.1426 1.5416 2.9745 1.1413 1.9346 1.2112 1.9814 1.6252 1.6334 1.5956 3.2232 2.1053 1.6658 1.2506 2.4715 2.6053 1.0453 1.1578 6.3435 7.2271 6.6767 1.0375 1.0603 1.0990 1.0971 1.0982 1.0853 1.0893 1.0945 1.1002 1.0960
irintensity: 1.1343 0.0164 5.3098 0.4859 10.4677 4.3139 1.2451 1.9124 1.6412 1.5122 0.5066 0.4363 30.3152 2.2650 9.2962 81.4781 0.7248 0.3795 3.8001 6.5134 1.1869 0.0014 20.1924 4.2991 4.8029 1.5269 1.5552 4.6319 0.2364 2.0343 1.9557 0.7261 0.1884 10.1870 10.2487 15.4546 18.9681 4.7295 4.6353 14.9603 15.6663 1.4812 1.9386 5.3534 29.8701 19.2959 12.2522 22.0429 24.0221 3.8142 4.3997 37.0929 33.7037 10.8766
temp: 298.150 k
press: 1.00000 atm
elementType: 6 6 6 6 6 6 6 6 6 6 1 1 1 1 1 1 1 1 1 1
symmnumber: 1
zpe: 434315.9 jmol-1
zpe.correction: 0.165422 hartree
zpe.thermalcorrener: 0.173628 hartree
zpe.thermalcorrenthalpy: 0.174572 hartree
zpe.thermalcorrgfe: 0.132791 hartree
zpe.sumelectzpe: -386.355760 hartree
zpe.sumelectthermal: -386.347554 hartree
zpe.sumelectthermalent: -386.346610 hartree
zpe.sumelectthermalfe: -386.388391 hartree
dipole: 0.5649 0.3117 -0.0002
dipole: 0.6452
quadrupole: -53.4824 -51.6282 -63.5337
quadrupole: -0.3322 0.0007 -0.0005
quadrupole: 2.7324 4.5866 -7.3189 -0.3322 0.0007 -0.0005
hfenergy: -386.5211821 hartree
pointgroup: C01 [X(C10H10)]
dipole: 0.2270196 0.1135481 -0.0000743 debye
dipolederiv: -0.1019121 0.1362259 -0.0000281 0.2389595 0.1088861 -0.0000255 -0.0000236 -0.0000671 -0.0586389 0.2216851 0.2047074 -0.000018 0.0667623 -0.1628643 0.0000278 -0.0000229 0.000018 0.0133916 -0.0383043 -0.0104551 0.0000124 -0.0525703 -0.1823361 0.0000675 0.0000408 0.0001414 0.1947495 0.2050745 -0.2268567 0.0000318 -0.2215583 0.1717791 -0.0000333 0.0000285 -0.0000298 -0.06708 -0.1558825 -0.0929706 0.0000092 0.0110747 0.0257628 -0.000036 0.0000138 -0.000046 -0.2773865 0.045241 -0.092929 0.0000386 -0.0733478 0.0888616 0.000004 0.0000169 0.0000158 -0.1715571 -0.0710545 -0.0631668 0.0000156 -0.081619 0.0614747 -0.0000019 0.0000175 0.0000034 -0.1754374 -0.0224956 0.0652522 -0.0000141 0.0853654 -0.0819805 0.0000348 -0.0000031 0.0000175 0.0938932 -0.0133377 -0.0225058 0.0000139 -0.0875064 -0.0462276 -0.0000132 -0.0000078 -0.0000026 -0.179582 -0.0014437 0.0608058 0.0000162 0.1434593 0.0513245 0.0000126 0.0000261 0.0000027 -0.1672969 0.0505936 0.0260492 -0.0038944 -0.0074511 0.0116334 0.0977919 0.0139631 0.1422066 -0.0122906 0.0505894 0.0260274 0.0038614 -0.0074621 0.0115566 -0.0978213 -0.0139837 -0.1422546 -0.0121882 -0.1216138 -0.0429954 -0.0000059 -0.02569 0.0766206 0.0000073 -0.0000235 0.0000055 0.1708348 0.052033 0.0495563 -0.0000084 0.0906384 -0.0997903 0.000008 -0.0000093 -0.0000013 0.1543683 0.0652643 0.0858417 -0.0000088 0.0607847 -0.091296 0.0000078 -0.0000123 0.0000054 0.1548538 -0.1610642 0.0086732 -0.0000536 -0.0920122 0.0638075 -0.0000181 -0.0000461 0.0000077 0.1101963 0.083538 -0.0135039 -0.0653427 0.0215027 -0.019626 -0.0951086 -0.013006 -0.126082 -0.0466106 0.0835072 -0.0135657 0.0654082 0.0214469 -0.0195937 0.0951016 0.0130612 0.1260658 -0.0465899 -0.1463628 0.029098 -0.0000203 0.0316778 0.0814438 0.0000035 -0.000012 0.0000006 0.1635384 -0.0240549 -0.113288 -0.0000129 -0.1224548 -0.0494364 -0.0000088 -0.0000175 -0.000007 0.1588322 unknown
polarizability: 137.0997653|7.100021|119.2891691|0.0050336|-0.0026046|51.4050816 unknown
InChI: InChI=1S/C10H10/c1-8-6-7-9-4-2-3-5-10(8)9/h2-6H,7H2,1H3
charge 0 multiplicity 1
20 atoms
C  -0.314284 0.937994 0.00002
C  0.192781 -0.397228 0.000105
C  0.859816 1.908003 -0.000074
C  1.675711 -0.344854 0.00012
C  2.064068 0.973212 0.00003
C  -1.698166 1.180916 -0.000115
C  -0.691099 -1.500484 0.000025
C  2.554103 -1.569427 0.000301
C  -2.586417 0.073317 -0.00016
C  -2.085474 -1.252918 -0.000095
H  0.852209 2.567872 -0.890565
H  0.852299 2.568281 0.890104
H  3.098177 1.329511 0.000023
H  -2.091358 2.204525 -0.000151
H  -0.311614 -2.529122 0.000052
H  3.624709 -1.30198 0.000513
H  2.360223 -2.19947 -0.889338
H  2.359822 -2.199405 0.889891
H  -3.669416 0.241996 -0.000234
H  -2.788189 -2.094239 -0.000152
