program: Gaussian 09
title: 000167449
version: EM64L-G09RevD.01
frameworkgroup: C1[X(C14H11ClO3S)]
method: RPBEPBE
basis: SDD
operation: Freq
keyword: #p
keyword: freq=noraman
keyword: PBEPBE/SDD
title: #p freq=noraman PBEPBE/SDD
converged: YES YES NO NO
title: Mulliken charges:
elementType: Cl S O O O C C C C C C C C C C C C C C H H H H H H H H H H H
charge: -0.030093 0.332461 -0.405842 -0.234127 -0.201872 -0.334770 0.524751 -0.350284 -0.462359 0.408438 -0.686225 -0.336709 -0.351899 0.180786 0.137830 -0.234823 -0.244880 -0.134798 -0.515218 0.253707 0.295103 0.243836 0.234575 0.244859 0.227168 0.264243 0.273638 0.252216 0.271094 0.379191
chargesum: 0.00000
title: Mulliken charges with hydrogens summed into heavy atoms:
elementType: Cl S O O O C C C C C C C C C C C C C C
charge: -0.030093 0.332461 -0.026650 -0.234127 -0.201872 -0.081063 0.524751 -0.055182 -0.218523 0.408438 0.020378 -0.336709 -0.087655 0.180786 0.137830 -0.234823 0.028758 0.117418 -0.244124
polarizability: 2.62516373e+02 1.27196304e+01 1.74921007e+02 -5.64016543e+00 -2.69702560e+00 1.29211942e+02
1716.lowfreq: -3.7830 -0.0021 -0.0020 -0.0019 3.3171 10.0894 23.6545 26.9955 35.9438
frequency: 23.4959 26.9036 35.9390 44.0568 55.6659 97.1533 108.3657 131.9558 142.7073 174.6307 184.6191 202.8562 222.4865 249.9790 270.3090 305.3357 361.4815 381.6901 394.6411 435.1908 445.2919 455.5492 519.3243 541.1718 564.4035 605.1435 621.1132 640.4847 662.1382 666.9167 687.8011 707.6153 724.8264 736.4033 764.2641 785.2825 815.1051 840.6756 849.4512 853.7209 873.3828 904.2345 926.9754 967.6840 996.8747 1026.9834 1037.4228 1060.1576 1071.6021 1088.2211 1094.0485 1145.3385 1152.0226 1197.4566 1223.1503 1237.0390 1260.2553 1282.5132 1295.9940 1342.4839 1344.8599 1373.6599 1390.4914 1397.6424 1450.9515 1468.7023 1475.2107 1478.3127 1519.7731 1543.7878 1558.5996 1607.1549 1659.2166 2995.6968 3053.7657 3095.0026 3108.3445 3137.2356 3155.0859 3161.7972 3176.5328 3193.3994 3232.6355 3502.8656
redmass: 7.8671 5.7801 9.0767 8.2807 6.0291 6.8811 6.9700 6.3877 5.5347 6.5745 6.0095 7.0978 1.0701 3.9859 5.4164 6.7072 5.9715 5.5215 9.5185 6.4492 3.4261 5.5873 6.6507 4.4620 3.1179 3.3960 2.7171 2.6346 4.3167 4.0049 5.9338 4.7245 1.1988 5.6937 4.7099 3.2568 3.5804 3.1381 1.5447 1.5714 4.6127 1.4718 1.3915 1.3966 2.3723 3.4215 2.4197 1.7044 1.6177 1.1813 2.3286 1.7557 2.2543 1.9188 1.4904 1.4933 1.4503 2.3927 2.3830 2.3460 2.1898 3.9505 1.2839 2.2184 6.4621 1.2923 1.0709 1.8168 7.2454 8.2048 7.2860 6.8914 8.1712 1.0350 1.0856 1.1005 1.1008 1.0885 1.0928 1.0966 1.0898 1.0979 1.1003 1.0638
irintensity: 0.1650 3.0249 2.2236 0.9153 2.8389 0.0965 0.9339 0.0663 0.6072 0.5705 1.1270 1.1657 0.5783 1.9916 2.5853 3.8925 1.2235 2.1929 3.4086 18.4380 9.6250 2.4352 6.7436 39.2000 1.5838 38.8527 48.7218 15.2522 2.7606 54.2775 9.9480 64.7224 85.8270 28.5003 5.2560 27.1944 23.5381 7.2377 9.8669 14.5020 47.3656 14.0477 0.2276 1.0341 9.4309 10.2351 278.8812 39.5548 23.1345 4.6207 62.8521 4.2938 7.2856 6.5390 6.2368 3.1330 10.2135 67.9579 122.2020 17.3680 30.6982 9.2222 16.3383 63.7072 111.5285 4.3087 14.5409 12.4386 55.2413 130.8169 67.5929 74.1915 172.3927 24.5424 5.2254 33.5766 14.9679 7.1311 0.4417 6.2085 5.2166 1.7799 0.5020 25.6915
temp: 298.150 k
press: 1.00000 atm
elementType: 17 16 8 8 8 6 6 6 6 6 6 6 6 6 6 6 6 6 6 1 1 1 1 1 1 1 1 1 1 1
symmnumber: 1
zpe: 559856.6 jmol-1
zpe.correction: 0.213238 hartree
zpe.thermalcorrener: 0.231375 hartree
zpe.thermalcorrenthalpy: 0.232319 hartree
zpe.thermalcorrgfe: 0.163979 hartree
zpe.sumelectzpe: -1622.525969 hartree
zpe.sumelectthermal: -1622.507832 hartree
zpe.sumelectthermalent: -1622.506888 hartree
zpe.sumelectthermalfe: -1622.575228 hartree
dipole: 2.0244 -2.0791 -3.3173
dipole: 4.4074
quadrupole: -106.2239 -124.9066 -124.6626
quadrupole: 16.9615 -0.2959 4.0307
quadrupole: 12.3738 -6.3089 -6.0649 16.9615 -0.2959 4.0307
hfenergy: -1622.7392074 hartree
pointgroup: C01 [X(C14H11Cl1O3S1)]
dipole: 0.797304 1.401351 0.6382308 debye
polarizability: 262.676089|-7.4597763|158.6700196|11.0686615|-21.970728|145.3032138 unknown
InChI: InChI=1S/C14H11ClO3S/c1-8(14(17)18)9-4-5-10(11(15)7-9)13(16)12-3-2-6-19-12/h2-8,17H,1H3
charge 0 multiplicity 1
30 atoms
Cl -0.824783 -0.253141 -2.323294
S  -4.838197 -0.256425 0.245622
O  4.519151 1.931983 0.889811
O  4.115473 1.402345 -1.333875
O  -2.554071 -2.152184 0.984133
C  3.73112 -0.308052 0.424796
C  2.202123 -0.445871 0.434291
C  1.452191 -0.256357 -0.753097
C  1.525947 -0.823901 1.62001
C  -0.643375 -0.786259 0.446601
C  4.398124 -1.431608 -0.414595
C  0.056061 -0.426297 -0.729544
C  0.129026 -1.00245 1.618515
C  4.128305 1.058088 -0.131531
C  -2.135361 -1.032034 0.551235
C  -3.053059 0.06688 0.236262
C  -2.790527 1.413712 -0.031847
C  -3.969724 2.201582 -0.239499
C  -5.142462 1.459609 -0.130992
H  4.091541 -0.357157 1.465895
H  1.953562 0.023114 -1.685192
H  2.093127 -0.983763 2.5436
H  4.090161 -2.419626 -0.032167
H  4.099965 -1.354887 -1.473655
H  5.499122 -1.361444 -0.361251
H  -0.391835 -1.318122 2.528296
H  -1.776171 1.816756 -0.073642
H  -3.955986 3.270953 -0.461248
H  -6.170247 1.801249 -0.246815
H  4.748197 2.818907 0.497178
