program: Gaussian 09
title: 000167430
version: EM64L-G09RevD.01
frameworkgroup: C1[X(C8H12ClN3OS)]
method: RPBEPBE
basis: SDD
operation: Freq
keyword: #p
keyword: freq=noraman
keyword: PBEPBE/SDD
title: #p freq=noraman PBEPBE/SDD
converged: YES YES NO NO
title: Mulliken charges:
elementType: Cl S O N N N C C C C C C C C H H H H H H H H H H H H
charge: -0.069183 0.194765 -0.165743 -0.049432 -0.360677 -0.008049 -0.344046 -0.437337 -0.336359 -0.089297 -0.692413 -0.110725 0.252937 -0.667652 0.197267 0.219754 0.227015 0.246493 0.195708 0.202820 0.220735 0.211038 0.214772 0.340721 0.303592 0.303297
chargesum: 0.00000
title: Mulliken charges with hydrogens summed into heavy atoms:
elementType: Cl S O N N N C C C C C C C C
charge: -0.069183 0.194765 -0.165743 -0.049432 -0.019956 -0.008049 0.072975 0.036171 0.062169 -0.089297 -0.045868 -0.110725 0.252937 -0.060763
polarizability: 2.11937688e+02 -2.06420888e+00 1.36923327e+02 -1.16344397e+01 9.17227635e+00 8.43408328e+01
1716.lowfreq: -4.7873 -3.3413 -0.0006 0.0008 0.0015 1.2502 5.8687 28.1395 34.4731
frequency: -3.1921 28.0535 34.4596 64.5169 73.0275 89.5985 95.1277 113.5549 169.7810 189.6422 220.6806 237.0798 286.2329 321.3129 342.2714 381.6002 433.0185 465.8405 533.7311 543.7433 556.5174 586.8356 595.9000 676.0579 703.4397 728.8066 733.8644 789.2702 807.4665 882.0682 897.2066 902.3295 920.7067 994.6391 1003.4541 1062.0788 1071.8891 1106.0514 1116.1244 1152.4568 1177.0649 1200.4804 1217.1630 1255.8094 1259.4082 1278.7770 1290.7500 1320.8404 1348.8864 1392.1014 1416.2703 1444.5075 1466.7737 1467.2564 1476.6927 1478.2132 1488.1695 1500.7488 1506.2026 1637.3318 2967.3736 2975.5650 2977.7197 2986.5091 3011.0386 3038.9406 3065.0856 3071.2950 3074.0483 3076.7317 3154.4179 3454.4333
redmass: 9.0978 7.1008 6.0417 3.3641 2.2000 2.7491 4.5033 2.4613 7.9929 4.6369 3.1055 1.2098 6.9422 4.7651 4.3048 8.9240 4.8395 6.7427 5.1780 4.6707 6.8051 7.6722 7.1233 6.7238 1.1905 7.3809 1.0819 1.2223 8.4340 4.9199 1.8948 1.7406 1.4360 3.7727 4.9375 3.5340 2.7250 2.0460 2.3686 1.1075 3.7368 3.2529 1.4881 1.2932 1.1775 1.2000 1.0639 1.3833 1.5573 1.2116 1.0870 1.1294 2.4287 1.4592 1.0697 1.0444 1.0847 4.5133 2.1281 7.4692 1.0588 1.0406 1.0567 1.0634 1.0982 1.1003 1.1007 1.0565 1.1010 1.0995 1.1094 1.0772
irintensity: 0.0782 1.0485 0.1369 12.4716 3.6212 0.9008 0.9426 0.4010 4.8458 2.9831 1.6090 0.2154 1.6043 1.9187 0.3547 3.4456 6.9195 58.0120 16.6137 11.6872 5.8816 0.1464 2.8375 63.2065 84.8706 5.3811 8.5786 1.2109 0.5726 15.8760 8.2690 13.0086 1.5716 26.4658 2.7896 13.0256 12.1206 16.4370 0.9550 0.7395 26.1045 77.5972 6.5935 2.0107 14.9785 2.0671 0.7927 1.7175 0.4679 11.9843 37.7244 7.7936 36.6822 35.8127 3.4585 13.6523 21.8622 823.3460 96.3299 176.9449 17.7978 23.3700 30.5298 39.9078 4.8906 13.2913 2.4738 2.1491 89.2055 51.3379 0.2512 146.4859
temp: 298.150 k
press: 1.00000 atm
elementType: 17 16 8 7 7 7 6 6 6 6 6 6 6 6 1 1 1 1 1 1 1 1 1 1 1 1
symmnumber: 1
zpe: 516709.3 jmol-1
zpe.correction: 0.196804 hartree
zpe.thermalcorrener: 0.211564 hartree
zpe.thermalcorrenthalpy: 0.212508 hartree
zpe.thermalcorrgfe: 0.152275 hartree
zpe.sumelectzpe: -1408.551800 hartree
zpe.sumelectthermal: -1408.537041 hartree
zpe.sumelectthermalent: -1408.536097 hartree
zpe.sumelectthermalfe: -1408.596329 hartree
dipole: 1.3387 -4.2588 -0.7116
dipole: 4.5206
quadrupole: -78.6890 -114.3556 -97.1911
quadrupole: 1.6954 -1.3749 -2.0162
quadrupole: 18.0562 -17.6104 -0.4459 1.6954 -1.3749 -2.0162
hfenergy: -1408.7486046 hartree
pointgroup: C01 [X(C8H12Cl1N3O1S1)]
dipole: 0.6554089 -1.5799757 -0.487208 debye
dipolederiv: -0.3277171 -0.0394902 0.0021111 -0.2896903 -0.5610909 -0.1762299 -0.1138344 -0.1999818 -0.2397088 -0.5436001 -0.0558609 0.0356758 0.0549074 -0.5218144 -0.160135 0.099968 -0.1475983 0.044437 -0.7275102 -0.1227829 -0.0175481 0.534317 -0.6672053 -0.2783799 0.3513464 -0.1923572 -0.4531644 -0.2433731 -0.1326187 -0.0253855 0.216514 -0.4104001 -0.0598959 0.0370175 -0.0437708 -0.1600591 -2.2563288 -0.0619262 0.2127499 0.023718 -0.4401354 -0.0603558 0.3307616 -0.0536769 -0.3701225 -0.4025394 0.1738193 0.0181736 -0.3261829 -0.4086542 -0.0582687 -0.0564225 -0.0833164 -0.1365142 -0.0282141 -0.0033823 0.0112589 -0.1081202 0.107985 0.0372512 0.1496874 0.0497274 0.1190768 -0.192374 0.0569322 -0.0447829 0.0871608 0.025587 0.0339571 -0.0719447 0.0191984 0.1198605 0.1098005 0.0142714 -0.0170943 0.0938477 0.1267281 0.0654936 -0.1059127 0.0533253 0.1200499 0.673222 0.1559376 0.0277334 0.213805 0.6544287 0.2051054 -0.0836097 0.196774 -0.0429248 -0.0701511 0.0518506 -0.0523394 0.018467 0.0477367 0.0431532 -0.005051 0.0420732 0.047209 1.6773716 -0.02538 -0.1318755 0.2186757 0.6009502 0.0752678 -0.037546 0.1101531 0.0891878 1.9015386 0.1671205 -0.1527063 -0.9911921 0.6871475 0.3954907 -0.7619242 0.2454488 0.4652031 -0.0849986 -0.1177322 -0.027117 0.2167254 0.6650672 0.2454093 0.1313285 0.2763061 0.2658245 0.0172386 -0.0718856 -0.0235 -0.0949684 -0.1188559 -0.009756 -0.0330395 -0.038037 0.0522451 0.0404972 0.0228036 0.0479209 0.0212517 0.0556461 -0.0415423 0.0458166 -0.0194439 -0.12975 -0.0019002 -0.0040414 0.0451191 0.0183972 0.0817391 -0.0711846 0.0501211 -0.0159268 -0.0878299 0.019823 -0.0409715 -0.0035992 -0.0616703 -0.0596163 -0.0033749 -0.0274681 -0.0306556 0.0906521 0.0214591 0.0173328 0.0221671 0.025313 0.0605582 -0.0393282 0.0677272 -0.0211346 -0.1921348 0.0164453 -0.0273318 -0.0131505 -0.0838148 -0.1761635 -0.0088934 -0.0158296 -0.0230473 0.0679203 -0.2403248 0.0226569 -0.0100759 0.0147097 0.0839815 0.0207586 0.0019676 0.0180399 0.0826815 0.0826471 -0.0968135 -0.0208091 -0.0374882 -0.1559385 -0.0123238 -0.0295514 -0.0484457 0.065086 0.0929662 0.0211121 0.0824596 0.0270527 0.0607813 -0.0607279 0.0242225 -0.0230442 -0.1572259 0.3366426 0.111169 0.052184 0.2189923 0.2752945 -0.0343917 0.0615464 -0.0309682 0.2853488 0.0453208 0.0122008 -0.0481365 0.0284692 -0.0212082 -0.0037726 -0.07055 -0.0267015 0.0582159 0.0840588 -0.0269897 0.0305666 -0.0391965 0.0074515 -0.0433259 0.061173 -0.01294 -0.003564 unknown
polarizability: 213.0068811|2.5259308|132.9196153|-1.7995551|16.5933844|87.2753515 unknown
InChI: InChI=1S/C8H12ClN3OS/c1-2-3-4-7-11-12-8(14-7)10-6(13)5-9/h10H,2-5H2,1H3
charge 0 multiplicity 1
26 atoms
Cl -4.526086 -2.235199 -1.118523
S  0.47554 -0.942379 -0.907111
O  -3.481162 1.331967 0.553956
N  0.763806 1.646556 -0.291148
N  -2.246564 -0.354903 -0.564218
N  -0.624437 1.42714 -0.248215
C  3.685497 -0.405598 0.249103
C  2.980983 0.562791 -0.740117
C  5.223689 -0.347476 0.114026
C  1.486869 0.580332 -0.614594
C  5.939565 -1.311354 1.083895
C  -0.953026 0.171332 -0.53146
C  -3.405225 0.233535 -0.048686
C  -4.705622 -0.55684 -0.245936
H  3.338416 -1.443196 0.068554
H  3.390067 -0.147293 1.284507
H  3.268214 0.295238 -1.776588
H  3.326693 1.597379 -0.561572
H  5.50931 -0.589241 -0.930192
H  5.566912 0.690234 0.300026
H  7.037473 -1.250538 0.973465
H  5.638798 -2.359499 0.897387
H  5.692127 -1.072993 2.135196
H  -2.378212 -1.276692 -0.998471
H  -5.400652 0.030988 -0.863225
H  -5.154477 -0.770991 0.734641
