program: Gaussian 09
title: 000167429
version: EM64L-G09RevD.01
frameworkgroup: C1[X(C7H8Cl3N3OS)]
method: RPBEPBE
basis: SDD
operation: Freq
keyword: #p
keyword: freq=noraman
keyword: PBEPBE/SDD
title: #p freq=noraman PBEPBE/SDD
converged: YES YES NO NO
title: Mulliken charges:
elementType: Cl Cl Cl S O N N N C C C C C C C H H H H H H H H
charge: 0.092438 0.092827 0.177237 0.213015 -0.114175 -0.059621 -0.336003 -0.007507 -0.115183 -0.079973 -0.675185 -0.675322 -0.108099 0.423703 -0.773729 0.221213 0.243665 0.219939 0.222827 0.222854 0.219838 0.243787 0.351456
chargesum: 0.00000
title: Mulliken charges with hydrogens summed into heavy atoms:
elementType: Cl Cl Cl S O N N N C C C C C C C
charge: 0.092438 0.092827 0.177237 0.213015 -0.114175 -0.059621 0.015452 -0.007507 0.106030 -0.079973 0.011246 0.011157 -0.108099 0.423703 -0.773729
polarizability: 2.21939122e+02 9.42523008e+00 1.39118187e+02 -5.40197497e-02 -6.51035762e-02 1.04756615e+02
1716.lowfreq: -29.0706 -18.3608 -6.9008 -0.7492 -0.0020 -0.0012 0.0028 1.8861 6.5756
frequency: -28.9348 -17.8805 6.3764 32.5878 64.6314 95.9688 133.6656 171.8215 172.0050 201.5434 216.1977 236.3220 246.7704 266.8905 271.0530 273.5783 305.6637 347.9610 382.7286 408.3239 423.8395 527.3489 544.9038 571.0917 573.8179 615.2240 637.9058 641.2646 716.1939 750.8143 752.3178 840.8206 862.2456 897.3134 924.6243 957.8132 983.2710 1019.1409 1091.7806 1107.3467 1123.8927 1164.2709 1181.4102 1287.3839 1341.4420 1376.6794 1393.4147 1460.2606 1461.8376 1471.4524 1475.7570 1491.7523 1496.0065 1503.7059 1665.8982 2988.0141 2989.6971 3009.8928 3085.0059 3089.1883 3098.5899 3104.8996 3521.4221
redmass: 9.3013 3.7467 6.9896 8.5172 8.5457 4.7838 6.8916 10.4197 9.5767 5.0566 1.0497 5.6312 2.1429 2.1315 10.4716 4.5574 9.3685 14.1803 17.9951 2.9394 6.5792 8.0471 2.2421 9.4425 11.1076 8.3948 2.5593 3.6313 8.6243 10.2445 11.6037 9.9513 3.2292 10.6516 1.1544 1.4776 4.8068 3.8803 2.2559 2.6031 4.0349 2.6135 2.3292 1.3136 1.5429 1.1830 1.2259 3.7165 1.0445 1.0483 1.0522 4.0596 1.4568 1.5409 8.9133 1.0346 1.0352 1.0846 1.1010 1.1002 1.1014 1.1005 1.0774
irintensity: 7.2942 0.0443 0.0037 0.0033 0.2163 2.4615 4.0114 0.3006 0.6352 0.6001 0.1063 1.7801 1.4502 0.6180 1.7840 1.2210 0.0327 4.2828 11.7879 3.0779 0.2459 11.2287 7.4084 17.3011 101.7937 0.6982 179.1569 7.3694 3.2583 61.4278 83.5823 70.7631 0.4693 20.9286 4.6446 0.2123 34.6644 53.2633 59.8014 1.3800 20.6817 68.9459 31.4039 0.0480 0.1455 15.9814 11.4782 28.7976 6.8300 2.2589 17.2979 429.5475 32.1691 309.4920 175.7314 27.6899 30.7176 8.5500 16.8179 51.0663 4.6012 36.3660 54.9574
temp: 298.150 k
press: 1.00000 atm
elementType: 17 17 17 16 8 7 7 7 6 6 6 6 6 6 6 1 1 1 1 1 1 1 1
symmnumber: 1
zpe: 389115.6 jmol-1
zpe.correction: 0.148206 hartree
zpe.thermalcorrener: 0.163440 hartree
zpe.thermalcorrenthalpy: 0.164384 hartree
zpe.thermalcorrgfe: 0.102448 hartree
zpe.sumelectzpe: -2288.082114 hartree
zpe.sumelectthermal: -2288.066880 hartree
zpe.sumelectthermalent: -2288.065936 hartree
zpe.sumelectthermalfe: -2288.127872 hartree
dipole: -2.7059 -4.9225 0.0097
dipole: 5.6172
quadrupole: -101.4642 -124.5948 -115.2753
quadrupole: 4.4851 -0.0175 0.0236
quadrupole: 12.3139 -10.8167 -1.4971 4.4851 -0.0175 0.0236
hfenergy: -2288.2303203 hartree
pointgroup: C01 [X(C7H8Cl3N3O1S1)]
dipole: -1.0499269 -1.9446524 -0.0003465 debye
dipolederiv: -0.3088048 0.0044168 0.0256761 0.1220372 -0.3614805 -0.3436555 0.1268732 -0.2945351 -0.5975048 -0.3087623 0.0048191 -0.0262491 0.1221135 -0.3574735 0.3421986 -0.128031 0.2930126 -0.6006671 -0.4753816 -0.3242493 0.0013716 -0.3329345 -0.3505739 0.0011761 0.0012218 0.0011599 -0.0914007 -0.5230757 0.0870758 0.0004074 -0.0600307 -0.5398449 0.0003016 0.0004459 0.0001119 0.0948477 -0.5118026 0.0911273 -0.0000061 -0.6373015 -0.7573698 0.0002774 -0.0006221 -0.0000774 -0.2129049 -0.3719727 0.1527088 -0.0001266 -0.2701686 -0.4412996 0.0000505 0.0002174 0.0001261 -0.1562679 -2.1725292 -0.2460131 0.000267 -0.5301466 -0.4547718 -0.0000095 0.0008192 0.0003678 -0.2612018 -0.2945712 -0.1265097 -0.0000024 0.3033731 -0.4086913 0.0000957 0.0000087 0.0001615 -0.1325766 -0.0066045 -0.0093535 -0.0000506 0.245512 0.1134725 -0.0004336 -0.0019563 -0.000611 0.0722031 0.7852433 -0.2223767 0.0000333 -0.1668572 0.6263646 0.0000618 0.0005985 0.0000903 -0.0725739 -0.0588244 0.0154804 -0.0276931 -0.0858936 0.0416704 0.0145675 0.1200002 0.0329357 -0.0021106 -0.0582277 0.0157585 0.0276759 -0.086577 0.0411727 -0.0149882 -0.1188541 -0.0332911 -0.0016911 1.5317419 0.2038195 -0.0006212 0.0094247 0.638866 -0.0007786 -0.0010051 -0.0005392 0.0655599 1.6738677 0.0211516 0.0005 1.0578606 1.0039867 -0.0004514 0.0019174 -0.0002112 0.0565313 0.8112167 0.3955404 -0.0009228 0.3513893 1.0628524 0.0005981 -0.0009587 0.0006235 1.3910527 0.0399729 0.0538893 -0.0001347 -0.0025789 -0.1236014 0.0007035 0.0002013 0.0005738 0.0430183 0.1199671 -0.045455 -0.010914 0.0007239 -0.0931515 0.0273064 -0.0018769 -0.0294399 0.0813861 -0.2192045 -0.0473986 -0.0304906 -0.0337087 0.0872728 0.016766 -0.0397984 0.0195184 0.0762607 0.0835373 0.0559482 0.095594 0.0389479 0.0491209 -0.080743 0.0599745 -0.0523389 -0.1031033 0.0837224 0.05517 -0.0957002 0.0384203 0.0500486 0.0796681 -0.0597685 0.0514557 -0.1042985 -0.2192711 -0.0469517 0.030517 -0.0333106 0.0871089 -0.0168463 0.0393656 -0.0196343 0.0765397 0.1202744 -0.0455684 0.0110519 0.0006035 -0.0928772 -0.0259254 0.0018514 0.0306592 0.081467 0.2794884 -0.0430296 -0.0001826 -0.0508981 0.1791988 0.0000601 -0.0006241 -0.0001184 0.2974348 unknown
polarizability: 221.792042|10.0496661|139.2653791|-0.0453375|0.0093384|104.756503 unknown
InChI: InChI=1S/C7H8Cl3N3OS/c1-3(2)4-12-13-6(15-4)11-5(14)7(8,9)10/h3,11H,1-2H3
charge 0 multiplicity 1
23 atoms
Cl 3.76007 -1.272559 -1.520187
Cl 3.761787 -1.26351 1.525737
Cl 4.926241 1.078067 -0.005002
S  -1.405708 -1.579785 0.001125
O  2.047288 1.749559 -0.00087
N  -2.183245 0.977163 0.000586
N  1.15261 -0.436044 -0.001053
N  -0.781593 1.039472 -0.000705
C  -4.17003 -0.568024 0.002036
C  -2.692644 -0.246844 0.001491
C  -4.839949 -0.007521 -1.282597
C  -4.841221 0.002447 1.281548
C  -0.220024 -0.165459 -0.000397
C  2.18109 0.512782 -0.001019
C  3.598663 -0.169362 -0.000324
H  -4.284011 -1.668741 0.006192
H  -4.724819 1.088991 -1.324236
H  -5.917485 -0.251215 -1.278704
H  -4.38928 -0.437337 -2.194762
H  -4.392125 -0.421016 2.197443
H  -5.918962 -0.240352 1.277953
H  -4.72514 1.099118 1.315299
H  1.428887 -1.42183 -0.001855
