program: Gaussian 09
title: 000167370
version: EM64L-G09RevD.01
frameworkgroup: C*V[C*(HI)]
method: RPBEPBE
basis: SDD
operation: Freq
keyword: #p
keyword: freq=noraman
keyword: PBEPBE/SDD
title: #p freq=noraman PBEPBE/SDD
converged: YES YES YES YES
title: Mulliken charges:
elementType: I H
charge: -0.053129 0.053129
chargesum: 0.00000
title: Mulliken charges with hydrogens summed into heavy atoms:
elementType: I
charge: 0.000000
polarizability: 7.42293811e-01 1.04713686e-11 7.42293811e-01 8.83580257e-12 -3.54647076e-10 2.33700517e+01
1716.lowfreq: -58.7424 -58.7424 0.0000 0.0000 0.0000 2138.7369
frequency: 2138.7369
redmass: 1.0158
irintensity: 11.4988
temp: 298.150 k
press: 1.00000 atm
elementType: 53 1
symmnumber: 1
zpe: 12792.5 jmol-1
zpe.correction: 0.004872 hartree
zpe.thermalcorrener: 0.007233 hartree
zpe.thermalcorrenthalpy: 0.008177 hartree
zpe.thermalcorrgfe: -0.015304 hartree
zpe.sumelectzpe: -12.004161 hartree
zpe.sumelectthermal: -12.001801 hartree
zpe.sumelectthermalent: -12.000856 hartree
zpe.sumelectthermalfe: -12.024338 hartree
dipole: 0.0000 0.0000 -0.9167
dipole: 0.9167
quadrupole: -22.5269 -22.5269 -17.6086
quadrupole: 0.0000 0.0000 0.0000
quadrupole: -1.6394 -1.6394 3.2789 0.0000 0.0000 0.0000
hfenergy: -12.0090338 hartree
pointgroup: C*V [C*(H1I1)]
dipole: 0.1673545 -0.0567019 -0.3144257 debye
dipolederiv: -0.0672773 -0.0163496 -0.0906625 -0.0163496 -0.1099934 0.0307176 -0.0906625 0.0307176 0.0548038 0.0672773 0.0163496 0.0906625 0.0163496 0.1099934 -0.0307176 0.0906625 -0.0307176 -0.0548038 unknown
polarizability: 5.6140493|-1.6506131|1.3015426|-9.153053|3.1011714|17.9390474 unknown
InChI: InChI=1S/HI/h1H
charge 0 multiplicity 1
2 atoms
I  0.0000 0.0000 0.0000
H  0.7665 -0.2597 -1.4401
