program: Gaussian 09
title: 000167428
version: EM64L-G09RevD.01
frameworkgroup: C1[X(C7H9Cl2N3OS)]
method: RPBEPBE
basis: SDD
operation: Freq
keyword: #p
keyword: freq=noraman
keyword: PBEPBE/SDD
title: #p freq=noraman PBEPBE/SDD
converged: YES YES NO NO
title: Mulliken charges:
elementType: Cl Cl S O N N N C C C C C C C H H H H H H H H H
charge: 0.052019 0.011459 0.205349 -0.145703 -0.045173 -0.327668 -0.009491 -0.107733 -0.109212 -0.665897 -0.662926 -0.104678 0.344657 -0.729366 0.232125 0.228847 0.207449 0.236846 0.219301 0.225743 0.230509 0.346874 0.366668
chargesum: 0.00000
title: Mulliken charges with hydrogens summed into heavy atoms:
elementType: Cl Cl S O N N N C C C C C C C
charge: 0.052019 0.011459 0.205349 -0.145703 -0.045173 0.019206 -0.009491 0.124392 -0.109212 0.007245 0.012627 -0.104678 0.344657 -0.362698
polarizability: 2.04177633e+02 3.65507457e+00 1.32238075e+02 -8.54069360e-02 8.91839666e-01 9.48023983e+01
1716.lowfreq: -27.9364 -6.6807 -3.6927 -3.2312 0.0031 0.0034 0.0040 16.9079 33.2063
frequency: -23.8871 15.7818 33.1865 38.0139 69.5264 109.2660 137.0325 168.1320 200.1260 205.0140 234.0912 243.1615 270.4351 289.9292 325.2413 380.2544 393.3637 434.0828 474.2453 535.8482 573.3541 584.1478 595.6303 623.9880 653.2395 680.8383 709.5380 745.2633 814.9901 864.3366 890.2286 922.8787 958.8861 987.1999 1015.7185 1094.4749 1121.7868 1139.4182 1175.6130 1183.9718 1187.1920 1224.9643 1282.0059 1319.7458 1381.5875 1397.9754 1457.4477 1461.2469 1466.8982 1477.9069 1490.1090 1496.1920 1503.3678 1643.7219 2973.3093 2985.0238 2997.4811 3084.6199 3090.9277 3097.9054 3106.9137 3165.5420 3497.2952
redmass: 3.2188 11.3911 14.5668 6.5261 7.4734 5.6337 7.3350 6.4635 1.7395 1.6807 5.0509 1.7914 4.8261 2.7062 5.5568 6.3931 5.8175 4.0948 7.3521 7.7363 11.2687 3.1346 8.1763 4.0260 1.8053 5.4020 6.4080 9.4558 8.3914 3.1529 7.1386 1.1760 1.4501 4.8646 3.5830 1.7938 2.5805 4.1617 2.2249 2.0636 1.1072 1.4084 1.3574 1.5758 1.1889 1.2385 2.5599 1.0852 1.1157 1.0447 1.4538 4.7788 1.6960 7.6033 1.0823 1.0349 1.0355 1.1002 1.1012 1.1004 1.1001 1.0898 1.0773
irintensity: 0.0417 1.2125 1.8348 1.8121 0.8124 6.1811 4.9927 0.8233 0.0356 0.0986 1.1442 0.2807 2.3494 0.3324 0.8438 12.6529 3.1190 2.2063 53.0364 23.9928 11.1378 36.5040 5.8308 9.9976 153.5838 47.1126 18.2028 24.8614 6.0261 1.2443 22.7739 3.6743 3.8596 36.6395 50.6921 5.5844 1.7488 13.1433 15.7195 41.4497 15.9752 20.9202 0.0649 8.2127 19.1343 10.3471 20.9315 5.1617 6.4297 21.7198 173.4970 349.8829 312.1453 213.2354 10.8175 23.5631 28.1928 33.4730 9.2378 50.0385 25.5782 0.4810 70.6705
temp: 298.150 k
press: 1.00000 atm
elementType: 17 17 16 8 7 7 7 6 6 6 6 6 6 6 1 1 1 1 1 1 1 1 1
symmnumber: 1
zpe: 416788.6 jmol-1
zpe.correction: 0.158746 hartree
zpe.thermalcorrener: 0.173461 hartree
zpe.thermalcorrenthalpy: 0.174405 hartree
zpe.thermalcorrgfe: 0.113750 hartree
zpe.sumelectzpe: -1828.708972 hartree
zpe.sumelectthermal: -1828.694258 hartree
zpe.sumelectthermalent: -1828.693313 hartree
zpe.sumelectthermalfe: -1828.753969 hartree
dipole: -1.7458 -4.5341 0.1804
dipole: 4.8620
quadrupole: -87.9890 -114.4595 -104.2603
quadrupole: 5.3642 -2.0456 1.3488
quadrupole: 14.2473 -12.2232 -2.0240 5.3642 -2.0456 1.3488
hfenergy: -1828.8677183 hartree
pointgroup: C01 [X(C7H9Cl2N3O1S1)]
dipole: -0.8510139 1.3649102 1.0352552 debye
dipolederiv: -0.323042 -0.0962787 0.0814174 -0.2685551 -0.2892884 0.2875846 0.2077064 0.1951417 -0.4514889 -0.3050423 -0.0447334 -0.0303688 -0.1528401 -0.1969483 -0.2417691 -0.2460256 -0.1402077 -0.6912709 -0.5618982 -0.0800117 -0.0506106 0.017239 -0.3074125 -0.3146878 0.0490161 -0.3082531 -0.1627008 -0.6295206 -0.0763747 -0.0312533 0.6310561 -0.719842 -0.1616162 0.3397014 -0.1940204 -0.2967107 -0.2837015 -0.111233 -0.102637 0.1666891 -0.3134459 -0.1325752 0.1700396 -0.1489361 -0.2492886 -2.1457176 0.1563628 0.0420779 0.418316 -0.4220503 -0.0728442 0.1497638 -0.0517853 -0.307434 -0.3478008 0.1250345 0.0791429 -0.2385784 -0.2909044 -0.14256 -0.1626327 -0.1424924 -0.2338726 0.0313402 0.0317202 -0.0132827 0.0617843 0.0344237 -0.0584984 -0.050915 -0.0549831 0.1278092 0.705073 0.1390557 0.1657991 0.1232597 0.3455272 0.3639785 0.0521244 0.3783991 0.2062767 -0.001294 -0.0349651 -0.0415946 0.0582536 -0.0141709 -0.020897 0.0235571 -0.0080585 0.0618193 -0.0505297 0.0059217 -0.0135794 -0.1013981 -0.0289423 0.0145891 0.0407502 -0.0019228 0.0769605 1.5763708 -0.1216412 -0.0788819 0.0493547 0.3704442 0.2846261 -0.0473308 0.2519245 0.304647 1.7051237 -0.0160575 -0.0299007 -1.1529931 0.9205187 0.265845 -0.681931 0.3235694 0.1646445 0.3939567 0.1011029 -0.0700041 0.3244897 0.4633719 -0.0662894 0.0297057 -0.0791529 1.2945402 -0.0209958 -0.0094415 -0.0049835 -0.0092495 0.0554746 -0.0044719 0.0157274 0.0151399 -0.1257471 0.1073262 -0.0057724 0.065294 -0.0259648 0.0777099 0.0344492 0.0090935 0.0002489 -0.1082963 -0.2165437 -0.0028702 0.0157225 0.035989 0.083974 -0.0230885 0.0257137 -0.0184288 0.0828834 0.1155777 0.0699045 -0.0281924 0.0256327 -0.1015737 0.057448 -0.0271361 0.0595055 0.0587762 0.0587906 -0.1104186 -0.0762529 -0.0936521 -0.0501231 -0.0474181 -0.0674436 -0.085991 0.0246709 -0.2115536 0.0642081 0.0279289 0.0588689 0.0797757 0.0202545 0.0215936 0.0119102 0.0935635 0.1028414 0.0032525 0.0600446 0.0080896 0.0688789 -0.0151206 0.0160391 0.0507079 -0.1178343 0.285551 0.0546948 0.0438508 0.0450657 0.2182668 -0.0403083 0.1175489 -0.0555729 0.2751656 0.0156885 -0.0414596 -0.0097365 0.019143 0.0163362 0.0133698 0.015334 0.0032578 -0.0271127 unknown
polarizability: 204.2215854|3.0100626|116.3379809|1.2239055|18.4908419|110.6585401 unknown
InChI: InChI=1S/C7H9Cl2N3OS/c1-3(2)6-11-12-7(14-6)10-5(13)4(8)9/h3-4,10H,1-2H3
charge 0 multiplicity 1
23 atoms
Cl 4.194324 1.266513 -0.898216
Cl 3.900881 0.8604 2.136411
S  -1.274384 0.91506 1.156211
O  2.408444 -1.766318 -0.33998
N  -1.873819 -1.130958 -0.462423
N  1.354575 0.168747 0.538216
N  -0.469505 -1.093255 -0.447788
C  -3.960948 -0.007542 0.417393
C  -2.4704 -0.200857 0.270646
C  -4.737806 -1.127861 -0.314434
C  -4.391364 1.400112 -0.084309
C  0.004291 -0.121527 0.325524
C  2.446967 -0.628009 0.180976
C  3.813974 0.02602 0.447398
H  -4.197728 -0.067381 1.500194
H  -4.538102 -1.097707 -1.399067
H  -5.821474 -0.992187 -0.148495
H  -4.442709 -2.125963 0.049665
H  -3.870875 2.209503 0.458874
H  -5.478059 1.529948 0.06425
H  -4.173025 1.509817 -1.161456
H  1.57494 1.03054 1.048037
H  4.606303 -0.730095 0.423173
