program: Gaussian 09
title: 000167427
version: EM64L-G09RevD.01
frameworkgroup: C1[X(C7H10ClN3OS)]
method: RPBEPBE
basis: SDD
operation: Freq
keyword: #p
keyword: freq=noraman
keyword: PBEPBE/SDD
title: #p freq=noraman PBEPBE/SDD
converged: YES YES NO NO
title: Mulliken charges:
elementType: Cl S O N N N C C C C C C C H H H H H H H H H H
charge: -0.069114 0.198978 -0.164466 -0.047645 -0.357516 -0.008191 -0.107122 -0.111040 -0.666751 -0.663663 -0.110465 0.253194 -0.669673 0.230545 0.229406 0.206282 0.235660 0.219538 0.224432 0.230121 0.340643 0.303412 0.303436
chargesum: 0.00000
title: Mulliken charges with hydrogens summed into heavy atoms:
elementType: Cl S O N N N C C C C C C C
charge: -0.069114 0.198978 -0.164466 -0.047645 -0.016873 -0.008191 0.123423 -0.111040 0.004597 0.010427 -0.110465 0.253194 -0.062826
polarizability: 1.94524694e+02 5.29820731e+00 1.32792870e+02 2.18482634e+00 4.43875693e+00 6.92007109e+01
1716.lowfreq: -3.6736 0.0007 0.0027 0.0030 3.6846 6.7445 12.1984 31.2306 45.4200
frequency: 9.4768 30.8869 45.4101 66.9044 73.0727 132.6125 149.0412 194.5707 199.2193 229.2571 268.7360 280.4293 317.7800 370.7569 395.0423 432.9635 458.5331 528.6452 547.8578 588.6036 597.8919 624.0486 669.7777 695.7252 708.9971 805.1842 864.4583 886.3491 901.8792 925.7116 958.5049 987.6412 1015.2403 1094.8775 1123.8824 1142.2841 1151.8245 1180.4157 1201.0610 1259.0855 1286.2857 1322.2643 1381.7007 1398.5271 1416.5349 1459.0926 1461.0601 1466.4703 1476.1360 1490.9289 1502.4381 1508.7711 1636.8082 2974.4561 2984.9592 2996.7195 3071.2416 3084.3174 3090.7027 3096.9894 3106.8906 3154.1781 3453.6362
redmass: 10.1622 3.3848 6.7230 2.7621 7.4715 3.8919 6.3850 4.5872 1.0827 1.3299 6.0561 2.6489 4.9098 8.3476 4.3131 4.1941 6.7693 6.0399 4.4509 7.2147 7.4405 4.2871 6.0575 6.5242 1.1706 8.0637 3.1347 7.8256 1.7399 1.1760 1.4500 4.9206 3.6049 1.7917 2.5873 3.9518 1.1080 2.1416 3.3215 1.1759 1.3515 1.5806 1.1898 1.2357 1.0869 2.1677 1.1917 1.0922 1.0441 1.3277 6.9899 1.7421 7.2074 1.0824 1.0349 1.0357 1.0564 1.1002 1.1011 1.1003 1.1001 1.1094 1.0773
irintensity: 0.1442 0.3326 0.8460 16.5343 1.0859 0.7610 5.9784 1.2180 0.2062 0.4747 1.2581 0.7802 0.8943 10.2635 2.9877 2.5467 46.8671 16.7727 2.0101 0.1401 0.8252 15.5219 56.4334 14.1674 84.7952 0.3752 1.2038 20.2202 13.2581 3.6475 3.8755 31.5878 47.5413 7.5383 1.7260 18.9750 0.5780 7.2170 79.6487 14.5258 0.1120 8.1756 18.4730 11.4609 36.1712 20.3290 5.5973 4.3589 20.0927 106.7433 573.1967 298.2647 170.8337 11.5406 24.2816 29.1633 2.2076 33.8458 9.8486 49.5447 26.8587 0.2510 147.7736
temp: 298.150 k
press: 1.00000 atm
elementType: 17 16 8 7 7 7 6 6 6 6 6 6 6 1 1 1 1 1 1 1 1 1 1
symmnumber: 1
zpe: 442234.0 jmol-1
zpe.correction: 0.168438 hartree
zpe.thermalcorrener: 0.182815 hartree
zpe.thermalcorrenthalpy: 0.183760 hartree
zpe.thermalcorrgfe: 0.123487 hartree
zpe.sumelectzpe: -1369.328994 hartree
zpe.sumelectthermal: -1369.314616 hartree
zpe.sumelectthermalent: -1369.313672 hartree
zpe.sumelectthermalfe: -1369.373944 hartree
dipole: -0.5125 -4.2213 -0.4060
dipole: 4.2716
quadrupole: -73.4800 -105.2328 -90.1947
quadrupole: 5.3267 0.9823 -1.1099
quadrupole: 16.1559 -15.5970 -0.5589 5.3267 0.9823 -1.1099
hfenergy: -1369.4974315 hartree
pointgroup: C01 [X(C7H10Cl1N3O1S1)]
dipole: -0.4863964 -1.4309373 0.7350012 debye
dipolederiv: -0.3396411 0.0324015 -0.03753 0.2712162 -0.51053 0.2276982 -0.1700708 0.2024779 -0.2802407 -0.5668758 0.0405163 -0.1071135 -0.0963398 -0.4353535 0.2442766 -0.0617856 0.2661625 -0.0602717 -0.7119986 0.0847094 -0.0893361 -0.5725245 -0.7127223 0.1749448 0.2738925 0.2420618 -0.4092268 -0.2252123 0.1301276 -0.0679603 -0.1869355 -0.3657045 0.101301 0.0712875 0.1274229 -0.1983653 -2.2629522 -0.1441897 -0.1165511 -0.2991908 -0.4556527 0.0527604 -0.0520576 0.0702503 -0.3392593 -0.3910305 -0.128988 0.0587004 0.2930296 -0.3636643 0.1440597 -0.1950217 0.0998319 -0.1936957 0.0314949 -0.0099782 0.0236416 0.0179762 0.0702049 0.0733527 0.0580103 0.0724736 0.1109595 0.6454625 -0.1687075 0.1351681 -0.110827 0.512709 -0.3103062 0.1889968 -0.3079655 0.0591059 -0.0035108 0.0471979 -0.0172129 -0.0453709 0.0360511 0.0273849 0.0377503 0.0507894 0.0124827 -0.035656 0.0066338 0.0095401 -0.0021293 0.0634577 0.0455633 -0.1036495 0.0284201 -0.0286901 1.6474095 0.1519554 0.0962757 -0.0337198 0.5161889 -0.1954305 0.2295566 -0.1986 0.1928181 1.8684381 0.0179821 0.1554889 1.1784639 0.8018971 -0.2077157 -0.4685006 -0.3237552 0.3584714 -0.0781877 0.0675486 -0.0609037 -0.2560344 0.6319638 -0.2984054 0.1149111 -0.2642929 0.2963037 -0.016617 0.0156471 -0.0100804 -0.0037882 -0.0930061 -0.0837611 -0.0194427 -0.0612863 0.0152988 0.1137781 -0.0454823 -0.0220518 0.0099972 -0.0643383 -0.0634232 -0.0171859 -0.103801 0.0280441 -0.215043 -0.0156595 -0.0453157 -0.0410521 0.0677514 0.0061982 -0.0140378 0.0139612 0.0958823 0.097365 -0.0051579 0.1005182 0.0119245 0.0751585 0.0223056 0.0590573 0.0222567 -0.1060868 0.0717798 0.1082691 -0.0627198 0.0884069 -0.0367565 0.1033195 -0.0509904 0.0665046 -0.0012455 -0.219825 -0.0535632 0.0126049 -0.04652 0.1018763 -0.0063198 0.0080797 -0.0158561 0.0758896 0.1038684 -0.0478008 -0.0108737 -0.0021216 -0.0738737 -0.1183593 0.0111389 -0.0564124 0.0212929 0.3593668 -0.110018 0.0640486 -0.1928521 0.2409489 0.0140342 0.1040774 0.0217785 0.3022451 0.0750237 -0.0072431 -0.0438653 -0.0234879 -0.026014 -0.0071129 -0.0702441 0.0191903 0.0351617 0.0525634 0.0337997 0.035528 0.0418793 0.0194082 0.0536352 0.0662284 0.0283877 0.0131263 unknown
polarizability: 193.8602806|-0.1123959|116.8515281|10.732369|-27.7344997|85.8064663 unknown
InChI: InChI=1S/C7H10ClN3OS/c1-4(2)6-10-11-7(13-6)9-5(12)3-8/h4,9H,3H2,1-2H3
charge 0 multiplicity 1
23 atoms
Cl 4.033093 -2.087955 1.450694
S  -0.979849 -1.452947 0.468789
O  2.865432 1.271851 -0.541904
N  -1.4514 0.87523 -0.764306
N  1.67614 -0.57251 0.356683
N  -0.058325 0.854052 -0.574906
C  -3.590774 -0.414212 -0.377232
C  -2.098837 -0.187907 -0.308174
C  -4.283179 0.71041 -1.183392
C  -4.199803 -0.545973 1.047544
C  0.355576 -0.253582 0.032235
C  2.821176 0.17444 0.065868
C  4.152055 -0.422201 0.543939
H  -3.755944 -1.376441 -0.905337
H  -4.14057 1.687871 -0.692095
H  -5.365712 0.500803 -1.251734
H  -3.868755 0.788095 -2.202319
H  -3.737919 -1.371548 1.618597
H  -5.283618 -0.744646 0.971121
H  -4.057999 0.390098 1.616457
H  1.844532 -1.451839 0.860808
H  4.631276 0.27225 1.249229
H  4.805803 -0.59584 -0.323066
