program: Gaussian 09
title: 000167329
version: EM64L-G09RevD.01
frameworkgroup: C1[X(C14H12Cl2N3O)]
method: RPBEPBE
basis: SDD
operation: Freq
keyword: #p
keyword: freq=noraman
keyword: PBEPBE/SDD
title: #p freq=noraman PBEPBE/SDD
converged: YES YES NO NO
title: Mulliken charges:
elementType: Cl Cl O N N N C C C C C C C C C C C C C C H H H H H H H H H H H H
charge: 0.091361 0.014364 -0.346928 -0.115870 -0.033713 0.114219 0.308329 0.287964 -0.196690 -0.491370 0.631350 -0.500879 -0.653773 -0.652453 0.335710 -0.340961 -0.342678 -0.161894 -0.163573 -0.143621 0.299100 0.310551 0.267442 0.274324 0.267494 0.316313 0.263038 0.259704 0.273115 0.273657 0.278268 0.278102
chargesum: 1.00000
title: Mulliken charges with hydrogens summed into heavy atoms:
elementType: Cl Cl O N N N C C C C C C C C C C C C C C
charge: 0.091361 0.014364 -0.346928 -0.115870 -0.033713 0.114219 0.308329 0.287964 0.102409 -0.180819 0.631350 -0.500879 0.155487 0.186602 0.335710 -0.067846 -0.069021 0.116374 0.114529 -0.143621
polarizability: 2.66938410e+02 -1.65868896e+01 2.87208383e+02 -3.40274072e-01 9.31922786e-01 1.19674469e+02
1716.lowfreq: -0.0017 -0.0009 0.0013 2.9369 3.7579 5.8512 19.8994 25.2530 34.5132
frequency: 19.8343 25.1242 34.4933 40.5491 48.8082 113.4791 117.0643 136.3877 142.9085 163.8917 181.2803 193.2307 213.2281 247.6131 297.7085 306.3922 327.6508 348.4010 352.0688 365.6456 397.2249 399.5300 413.0023 455.4670 471.7689 473.5680 486.5035 541.5494 570.6508 620.0672 621.4554 627.7657 677.7659 690.8033 704.2498 711.7599 740.0434 807.4730 820.8849 837.3082 847.7687 854.2254 922.2363 950.3062 963.5979 996.8402 1001.5429 1041.1842 1071.5505 1080.8724 1101.8998 1122.5658 1134.8919 1154.6026 1167.4338 1177.1597 1191.2065 1242.7953 1275.5786 1284.7474 1332.1781 1368.6448 1378.1346 1390.6209 1431.8577 1435.8885 1460.3782 1462.0692 1471.8788 1476.9693 1488.9725 1493.5283 1525.5611 1548.6480 1585.6909 1591.0368 1606.7842 2061.5789 2991.8310 2998.3318 3076.0837 3084.6024 3134.8144 3161.1242 3162.9856 3170.9620 3181.7742 3184.6067 3195.1345 3207.3552
redmass: 5.0699 3.4570 11.0679 3.8991 5.5105 8.8609 3.8015 2.1288 8.2802 4.3969 1.8699 7.3340 1.5285 8.0223 8.0808 3.8270 5.0499 4.1515 4.3204 8.7007 5.3734 8.7215 2.9468 5.3927 5.0033 3.8206 3.4591 5.5065 5.6576 6.8109 7.1974 8.1762 5.4541 7.3265 4.9029 3.1443 4.5063 5.8640 1.2503 1.6917 1.6792 1.4124 3.4262 1.3481 1.3578 4.0874 5.3801 1.9520 2.7742 1.2322 1.3130 2.9569 1.3998 2.4605 2.2810 1.3255 2.0067 4.0316 1.3203 1.2431 7.8971 7.0102 2.5713 3.5293 1.3593 1.2069 1.3738 1.9865 2.2780 1.4129 1.1067 1.0457 3.4547 3.6369 6.3567 8.0757 6.7090 13.9044 1.0373 1.0393 1.1018 1.1013 1.0996 1.0903 1.0901 1.0920 1.0968 1.0980 1.0963 1.0908
irintensity: 0.2516 0.0857 0.1880 0.0424 1.6948 0.1074 0.2344 0.6032 0.1030 1.6277 0.8953 1.7424 3.4818 2.0214 0.6898 0.9717 0.7949 2.0786 2.3489 1.7180 3.5790 3.2837 0.0011 0.6110 3.5984 6.3380 14.3757 12.4173 4.4678 26.7542 2.1422 0.9573 2.4619 11.8213 8.1626 0.7021 8.6297 17.0494 0.6553 60.9811 2.2992 44.8940 45.9850 2.8150 0.0261 79.9192 20.9998 33.6439 92.5526 0.6082 12.2201 31.4194 3.4807 138.9175 40.6310 36.0789 34.2754 165.7655 13.1052 0.0295 53.6041 0.2963 47.0113 5.9489 8.2181 25.0410 27.0425 78.1885 103.0805 40.7904 21.6547 4.1536 60.0395 205.7799 2.4971 0.8305 417.6107 695.3645 8.7434 29.6970 8.2624 8.3496 4.2104 1.1193 1.2531 9.0997 0.0047 0.6168 11.2359 1.6852
temp: 298.150 k
press: 1.00000 atm
elementType: 17 17 8 7 7 7 6 6 6 6 6 6 6 6 6 6 6 6 6 6 1 1 1 1 1 1 1 1 1 1 1 1
symmnumber: 1
zpe: 610021.5 jmol-1
zpe.correction: 0.232345 hartree
zpe.thermalcorrener: 0.251557 hartree
zpe.thermalcorrenthalpy: 0.252501 hartree
zpe.thermalcorrgfe: 0.181743 hartree
zpe.sumelectzpe: -1698.561584 hartree
zpe.sumelectthermal: -1698.542371 hartree
zpe.sumelectthermalent: -1698.541427 hartree
zpe.sumelectthermalfe: -1698.612186 hartree
dipole: -6.7595 3.3749 -0.0773
dipole: 7.5556
quadrupole: -91.8820 -93.2147 -118.5756
quadrupole: -12.2225 -0.4823 0.2248
quadrupole: 9.3421 8.0094 -17.3515 -12.2225 -0.4823 0.2248
hfenergy: -1698.7939285 hartree
pointgroup: C01 [X(C14H12Cl2N3O1)]
dipole: 2.3006792 -1.8727209 0.1899477 debye
polarizability: 259.9493911|-10.3404233|293.1561313|11.3816222|-5.4563026|120.7157394 unknown
InChI: InChI=1S/C14H12Cl2N3O/c1-19(2)13-7-11(16)12(18-17)8-14(13)20-10-5-3-9(15)4-6-10/h3-8H,1-2H3
charge 1 multiplicity 1
32 atoms
Cl 4.746916 1.088608 0.384167
Cl -5.816286 2.277137 -0.454606
O  -0.857341 -1.124537 -0.051182
N  1.435525 -2.892601 0.193599
N  2.165404 2.660365 0.100751
N  2.32697 3.818848 0.082598
C  1.548283 -1.52923 0.157728
C  0.428515 -0.585826 0.024365
C  2.866709 -0.940327 0.276649
C  0.642885 0.787138 0.006708
C  1.969629 1.320864 0.119824
C  3.083362 0.425955 0.256743
C  2.635308 -3.726095 0.479386
C  0.223781 -3.704619 -0.103083
C  -1.999658 -0.245864 -0.146578
C  -2.672163 0.113315 1.037624
C  -2.460627 0.133838 -1.422523
C  -3.847837 0.89119 0.941989
C  -3.636477 0.911431 -1.515913
C  -4.311045 1.282827 -0.332661
H  3.740692 -1.585844 0.36302
H  -0.209614 1.466244 -0.080202
H  3.355797 -3.697538 -0.358924
H  2.30997 -4.767073 0.614736
H  3.134148 -3.400126 1.407813
H  -0.62028 -3.074235 -0.391369
H  -0.049151 -4.293214 0.791095
H  0.465944 -4.40413 -0.9235
H  -2.301925 -0.219979 2.011626
H  -1.929728 -0.18286 -2.325341
H  -4.396619 1.178786 1.842891
H  -4.02469 1.214052 -2.492229
