program: Gaussian 09
title: 000167267
version: EM64L-G09RevD.01
frameworkgroup: C1[X(C5H9NO4S2)]
method: RPBEPBE
basis: SDD
operation: Freq
keyword: #p
keyword: freq=noraman
keyword: PBEPBE/SDD
title: #p freq=noraman PBEPBE/SDD
converged: YES YES NO NO
title: Mulliken charges:
elementType: S S O O O O N C C C C C H H H H H H H H H
charge: 0.067103 0.061606 -0.431858 -0.213908 -0.408291 -0.219485 -0.624999 -0.085377 -0.720610 0.220199 -0.712094 0.263705 0.261415 0.275452 0.302894 0.309822 0.281359 0.310138 0.293099 0.384639 0.385191
chargesum: 0.00000
title: Mulliken charges with hydrogens summed into heavy atoms:
elementType: S S O O O O N C C C C C
charge: 0.067103 0.061606 -0.047219 -0.213908 -0.023100 -0.219485 -0.033818 0.176038 -0.142265 0.220199 -0.108857 0.263705
polarizability: 1.57160633e+02 5.93832141e+00 9.40846845e+01 -7.46587921e-01 -6.17323803e+00 8.55487375e+01
1716.lowfreq: -11.8709 -3.5119 0.0005 0.0011 0.0031 4.9991 15.2153 21.8628 33.3891
frequency: 14.2082 21.7925 33.3859 47.3225 61.1085 75.5001 99.5621 130.3065 195.4602 238.6796 256.5876 271.8542 298.3308 356.8435 381.7129 421.3180 472.4001 495.9435 535.0462 560.9582 595.3797 627.8636 640.8010 670.7728 721.7682 737.3383 767.8967 862.4142 891.0666 905.1115 1010.6263 1046.3858 1050.4813 1099.9339 1137.7238 1153.1324 1206.9215 1221.5275 1251.0666 1264.8585 1306.9748 1317.7525 1381.9627 1408.2155 1418.4017 1637.0943 1661.3305 1677.6824 2882.1849 3039.0531 3041.1776 3108.2871 3120.2054 3465.1759 3514.6827 3519.6054 3595.4413
redmass: 7.1772 8.1114 7.9431 6.0047 4.7165 4.3617 8.0952 11.4461 11.1722 2.6678 1.5418 2.9486 2.6964 9.6816 4.5428 20.0481 3.9421 1.7786 3.9554 4.7928 1.3777 1.3694 1.6137 2.7322 3.6806 6.4107 2.7362 5.1416 1.7094 1.9595 3.9270 2.1936 2.1571 2.0875 1.1619 1.1455 1.5076 1.3026 1.1594 1.7043 1.3291 2.1745 1.9946 1.0967 1.0982 1.0912 8.7953 9.3928 1.0800 1.0580 1.0578 1.1048 1.1069 1.0450 1.0641 1.0641 1.0984
irintensity: 1.7388 1.3028 1.3370 1.7529 0.1883 2.5359 2.4370 1.8221 6.8891 7.5497 43.5214 1.5726 6.8492 8.8107 28.3418 5.5877 46.5897 30.3857 6.7780 42.3647 6.8830 128.9206 296.5941 117.8304 5.8373 24.8752 5.2418 4.3515 9.0998 5.7128 67.7354 574.0973 53.3371 21.7057 0.1639 2.3490 2.3100 0.9210 7.7156 27.3079 10.4310 58.8640 14.8371 16.3062 44.9091 54.7246 174.6331 186.0517 37.0521 19.1381 3.1618 1.2952 1.8982 5.2941 28.5756 30.2926 6.7909
temp: 298.150 k
press: 1.00000 atm
elementType: 16 16 8 8 8 8 7 6 6 6 6 6 1 1 1 1 1 1 1 1 1
symmnumber: 1
zpe: 388347.4 jmol-1
zpe.correction: 0.147914 hartree
zpe.thermalcorrener: 0.162830 hartree
zpe.thermalcorrenthalpy: 0.163774 hartree
zpe.thermalcorrgfe: 0.101410 hartree
zpe.sumelectzpe: -1346.746783 hartree
zpe.sumelectthermal: -1346.731866 hartree
zpe.sumelectthermalent: -1346.730922 hartree
zpe.sumelectthermalfe: -1346.793286 hartree
dipole: 0.2452 2.3213 1.4767
dipole: 2.7621
quadrupole: -65.5202 -87.1365 -90.7264
quadrupole: -5.8098 12.3904 3.1667
quadrupole: 15.6075 -6.0088 -9.5987 -5.8098 12.3904 3.1667
hfenergy: -1346.8946965 hartree
pointgroup: C01 [X(C5H9N1O4S2)]
dipole: 0.0658983 0.1165265 -1.0784136 debye
dipolederiv: -0.0004388 -0.1173398 -0.0540178 -0.0417076 -0.0984046 0.0230931 -0.0544644 -0.0161464 -0.0254901 0.0932272 -0.0250849 -0.0964986 -0.1141859 0.0493581 0.0142782 -0.0673711 -0.0340164 -0.1057507 -0.8788852 -0.467691 -0.2183142 -0.5321764 -0.8106511 -0.1070458 -0.1552377 -0.0462228 -0.3648266 -0.6614021 0.0366478 0.2053118 -0.2275891 -0.631347 -0.2279483 -0.01429 -0.3313951 -0.6004774 -1.0840758 -0.5105931 0.1436187 -0.5368507 -0.625532 0.1627259 0.2194845 0.1871825 -0.4681708 -0.7376933 0.1542203 0.1278139 -0.1863961 -0.8644616 0.0195256 0.1633768 -0.1061891 -0.3426379 -0.545249 0.0757849 -0.2064191 -0.0026198 -0.5903136 0.0482781 -0.3098184 0.061353 -0.6206716 0.1596621 -0.0840124 0.2452743 0.1862443 0.2451272 0.0596256 0.2829594 -0.089683 0.3800888 0.1786519 0.0218588 0.0961066 0.0408543 -0.0048708 -0.0632118 0.2637249 0.0350878 0.142125 1.2295574 0.4186268 -0.1643107 0.6671429 1.0175527 0.4717095 -0.1062684 0.4706994 0.6770666 -0.0441043 0.1509897 0.06705 0.507356 -0.1211065 -0.1294604 0.0822752 -0.0703134 0.0568759 1.4572323 0.2394938 -0.3724001 0.3052253 1.2721938 -0.029974 -0.4569464 -0.014663 0.3646907 0.0055525 0.0807555 -0.0697249 0.0734868 -0.0728217 0.0900166 -0.0294896 0.0666014 -0.0795443 -0.0433898 -0.036548 0.0546121 -0.0400969 0.0893261 -0.0092912 0.0252614 0.031029 -0.0604624 0.0299331 0.0877973 -0.03666 -0.0096673 0.0188328 -0.0187559 -0.0993365 -0.0083745 0.0655521 0.2290463 -0.0916318 0.0130593 -0.202387 0.1976042 -0.1041492 -0.0449844 -0.0131837 0.1950563 0.083295 0.0172349 0.0871738 0.0517083 0.3076858 -0.0909494 0.0794628 -0.0456408 0.1389055 0.0020421 -0.0557372 0.0006723 -0.104314 0.0495724 -0.0406797 0.0007196 -0.0419779 0.0376728 0.0151184 0.0048778 0.0011734 -0.0418613 0.0286494 0.0836638 0.0058544 0.0797391 0.0174671 0.2631076 0.0150603 0.1093516 0.0657236 0.3351899 -0.085792 0.1439539 -0.0655369 0.2251271 0.2488123 0.0852901 0.0671278 0.1421105 0.2084165 -0.0656587 0.0711339 -0.0483494 0.3674039 unknown
polarizability: 157.0312833|-0.447121|92.0125292|-6.9392188|6.9245552|87.7502429 unknown
InChI: InChI=1S/C5H9NO4S2/c6-3(5(9)10)1-11-12-2-4(7)8/h3,7,9H,1-2,6H2
charge 0 multiplicity 1
21 atoms
S  -0.168088 0.77502 1.380317
S  1.50267 -0.628604 0.723727
O  -4.147943 -1.218761 -0.002649
O  -3.479609 0.609907 1.263211
O  4.996535 0.978798 -0.587558
O  4.20427 -1.20462 -0.441185
N  -2.446956 -0.219124 -1.964127
C  -2.008925 -0.256147 -0.553721
C  -1.091023 0.945085 -0.265696
C  -3.248443 -0.198567 0.343835
C  2.784582 0.693686 0.271187
C  4.025793 0.019406 -0.274589
H  -1.463548 -1.19256 -0.278984
H  -0.339652 1.055434 -1.063449
H  -1.67364 1.877288 -0.181142
H  -3.262314 -0.809091 -2.156947
H  -1.683615 -0.367092 -2.630901
H  3.035734 1.281749 1.168106
H  2.367293 1.378672 -0.485295
H  -4.948666 -1.171857 0.586698
H  5.809545 0.525579 -0.941939
