program: Gaussian 09
title: 000167309
version: EM64L-G09RevD.01
frameworkgroup: C1[X(C15H20O7)]
method: RPBEPBE
basis: SDD
operation: Freq
keyword: #pfreq=noraman
keyword: PBEPBE/SDD
title: #p freq=noraman PBEPBE/SDD
converged: NO YES NO NO
title: Mulliken charges:
elementType: O O O O O O O C C C C C C C C C C C C C C C H H H H H H H H H H H H H H H H H H H H
charge: -0.439356 -0.198001 -0.194001 -0.475335 -0.450870 -0.186738 -0.241528 0.331128 0.154504 0.015658 -0.049240 0.178264 -0.640540 -0.520342 -0.132017 -0.443347 -0.306816 -0.400335 0.105564 -0.824442 -0.765971 0.150832 0.255015 0.254724 0.279926 0.246238 0.237691 0.273815 0.218685 0.228707 0.266669 0.255865 0.272172 0.230022 0.245062 0.206821 0.351616 0.262529 0.242149 0.246725 0.387063 0.371434
chargesum: 0.00000
title: Mulliken charges with hydrogens summed into heavy atoms:
elementType: O O O O O O O C C C C C C C C C C C C C C C
charge: -0.087739 -0.198001 -0.194001 -0.088272 -0.079436 -0.186738 -0.241528 0.331128 0.154504 0.015658 0.205776 0.178264 -0.105889 -0.036413 0.141798 0.004046 -0.040146 0.127702 0.105564 -0.142537 -0.014568 0.150832
polarizability: 1.82074412e+02 -1.11756002e-03 1.63822257e+02 -3.80994752e+00 6.27497501e+00 1.59403236e+02
1716.lowfreq: -0.0008 -0.0006 0.0005 8.5697 15.9246 20.7273 82.4408 91.4165 94.1760
frequency: 82.3653 91.4001 94.1577 107.6422 110.0882 117.7247 151.5451 183.4822 200.5127 213.5064 220.8603 236.6419 252.6969 260.1035 287.3389 292.5026 301.4071 329.7585 341.3004 355.3511 372.9359 385.3027 396.3387 416.4560 429.2182 447.6955 449.8694 463.1167 472.2334 500.7046 509.1426 536.7228 558.6133 575.5140 596.6005 624.2309 649.2795 688.0324 727.6486 735.4111 767.4476 778.6945 794.2637 822.2297 840.3497 855.4856 868.2826 874.0488 887.6833 910.3672 911.0393 936.9832 980.5420 985.8015 1000.9384 1021.8697 1023.6233 1035.2416 1040.3826 1048.6537 1071.3875 1079.3902 1092.4645 1095.6994 1104.2257 1113.5532 1125.4605 1132.7230 1150.6616 1156.6826 1176.9622 1182.2901 1209.1878 1231.8110 1242.9970 1267.4305 1280.2111 1284.8950 1291.2490 1302.7177 1310.3479 1313.4531 1325.7818 1329.7191 1341.8188 1356.8757 1369.9876 1388.2525 1395.7069 1412.9271 1444.0140 1462.7291 1466.4616 1470.5150 1475.1108 1477.0923 1488.2791 1493.3928 1626.2765 1737.1315 2895.6702 2965.6103 2993.2904 3009.8026 3011.8726 3017.8736 3043.5134 3054.5718 3068.4717 3077.8060 3078.9881 3080.3086 3084.0128 3087.3669 3110.7610 3112.6955 3162.9808 3292.1841 3474.3763 3490.9422
redmass: 7.4731 7.6185 3.2090 3.8702 6.1627 7.5657 3.6263 3.7456 2.8205 1.6595 2.0595 2.2247 3.5094 2.2085 3.8648 3.1823 3.9271 4.6338 4.0815 2.0115 2.4922 3.4396 3.8736 2.0168 4.7221 2.9178 3.2787 2.6168 1.5210 3.9271 4.1362 4.3257 3.8336 5.2297 5.8538 5.0351 4.6827 4.0084 4.0813 6.2578 1.2894 2.0609 2.2352 3.6884 7.5766 3.1903 2.8192 2.3958 2.6868 2.4672 2.7383 2.1015 1.9494 3.1723 3.2839 2.5680 3.6626 3.1833 3.1165 3.2251 1.9699 2.6579 1.3819 1.8436 2.1917 3.6999 2.7723 2.3930 2.1832 2.5581 2.2556 3.0860 1.6377 1.5993 1.1739 1.2678 1.2799 1.3914 1.6518 1.3370 1.3943 1.4561 1.3705 1.5451 1.4327 1.7334 1.5732 1.2153 1.1955 1.3251 1.1014 1.0563 1.0744 1.0870 1.0579 1.0726 1.0495 1.0733 12.1110 12.1980 1.0791 1.0368 1.0375 1.0663 1.0832 1.0591 1.0612 1.0977 1.0994 1.0671 1.0934 1.0968 1.0943 1.0934 1.0985 1.1036 1.1128 1.0668 1.0645 1.0657
irintensity: 3.7852 0.8267 3.1199 5.7519 5.1999 1.0933 1.5098 1.9293 7.0104 0.2278 4.4460 1.5482 2.6778 0.6184 8.0902 3.2029 33.6736 7.9392 9.4080 18.4363 41.1190 5.4897 17.5857 46.2872 36.4807 29.4156 6.6319 58.8612 106.9947 1.8810 2.1931 20.5970 1.5431 2.5101 6.3818 1.9588 3.1220 24.2385 6.4810 0.3412 104.1258 2.6938 11.2772 3.9584 33.5886 10.3693 18.4831 3.0789 1.7240 32.8101 0.3801 5.8478 5.1540 6.1832 42.5244 29.5640 133.6981 43.5949 80.1540 33.6584 11.6844 54.2926 1.4976 48.9452 8.8699 89.2063 19.2420 13.9195 17.9760 15.9807 6.1134 6.4028 21.5306 14.1944 2.7671 4.3502 10.6278 1.8741 6.7367 7.9984 27.3118 7.7495 2.3733 17.8859 0.0718 10.1622 20.3080 15.6870 35.8477 77.8314 8.0314 9.6863 10.3723 24.0361 14.6063 13.6102 10.4288 9.4993 214.9237 301.9422 24.9924 32.9238 10.2289 18.3831 7.3686 38.8649 20.8019 34.1165 22.7436 17.9889 6.5159 5.4554 5.4739 22.5329 3.9327 21.0361 3.1496 213.7884 28.0792 32.6195
temp: 298.150 k
press: 1.00000 atm
elementType: 8 8 8 8 8 8 8 6 6 6 6 6 6 6 6 6 6 6 6 6 6 6 1 1 1 1 1 1 1 1 1 1 1 1 1 1 1 1 1 1 1 1
symmnumber: 1
zpe: 882487.3 jmol-1
zpe.correction: 0.336122 hartree
zpe.thermalcorrener: 0.355987 hartree
zpe.thermalcorrenthalpy: 0.356931 hartree
zpe.thermalcorrgfe: 0.291138 hartree
zpe.sumelectzpe: -1108.445718 hartree
zpe.sumelectthermal: -1108.425853 hartree
zpe.sumelectthermalent: -1108.424909 hartree
zpe.sumelectthermalfe: -1108.490702 hartree
dipole: -1.9487 2.2730 -2.6470
dipole: 3.9963
quadrupole: -129.1123 -147.8444 -130.1088
quadrupole: 7.7620 -4.4000 -3.3154
quadrupole: 6.5762 -12.1559 5.5797 7.7620 -4.4000 -3.3154
hfenergy: -1108.7818398 hartree
pointgroup: C01 [X(C15H20O7)]
dipole: 0.8986096 -0.889841 -0.9341747 debye
polarizability: 181.3537307|2.2076761|163.1821154|5.5013089|-6.0439865|160.7640591 unknown
InChI: InChI=1S/C15H20O7/c1-7-3-4-15(20)13(7)5-8(22-10(17)9(13)16)12(2,19)14(15)6-21-11(14)18/h7-9,16,19-20H,3-6H2,1-2H3
charge 0 multiplicity 1
42 atoms
O  -0.187909 1.947567 -1.2799
O  0.131472 -2.558056 -0.505765
O  -2.451485 0.616411 1.917718
O  -1.865929 0.079969 -2.183365
O  2.012908 -0.411187 1.851015
O  -3.243511 1.722409 -0.04742
O  0.898845 -2.893373 1.620372
C  1.358279 0.17929 -0.511241
C  0.111817 1.075984 -0.12516
C  -1.15517 0.2097 0.19474
C  2.459836 1.286145 -0.645095
C  -1.473291 -0.766396 -1.011899
C  1.014586 -0.603848 -1.800665
C  0.653122 2.060014 0.931496
C  -0.200746 -1.505914 -1.529287
C  2.140624 2.296028 0.509232
C  1.784626 -0.919968 0.502261
C  -1.269177 -0.331586 1.657522
C  -2.418849 1.030165 0.557853
C  3.920841 0.803722 -0.656611
C  -2.613245 -1.75798 -0.724763
C  0.885605 -2.173337 0.596638
H  2.244855 1.795473 -1.603551
H  1.85727 -1.236064 -2.139022
H  0.779087 0.092208 -2.622589
H  0.618762 1.637532 1.9466
H  0.051748 2.983313 0.902347
H  -0.485282 -2.088966 -2.419078
H  2.301508 3.332292 0.16546
H  2.809513 2.109035 1.367045
H  2.743245 -1.327606 0.100022
H  -1.613526 -1.367427 1.778318
H  -0.433664 -0.094635 2.327143
H  4.595633 1.660306 -0.838098
H  4.211209 0.361252 0.314119
H  4.114335 0.063171 -1.45759
H  -0.793486 1.446414 -1.905165
H  -2.298937 -2.554268 -0.031817
H  -3.496962 -1.245988 -0.301673
H  -2.914759 -2.237329 -1.672443
H  -2.751354 0.493321 -1.989261
H  2.066353 -1.203991 2.453158
