program: Gaussian 09
title: 000167222
version: EM64L-G09RevD.01
frameworkgroup: C1[X(C6H10O7)]
method: RPBEPBE
basis: SDD
operation: Freq
keyword: #pfreq=noraman
keyword: PBEPBE/SDD
title: #p freq=noraman PBEPBE/SDD
converged: YES YES NO NO
title: Mulliken charges:
elementType: O O O O O O O C C C C C C H H H H H H H H H H
charge: -0.438975 -0.475100 -0.476227 -0.449748 -0.163017 -0.370619 -0.194634 -0.132460 -0.066033 -0.178753 -0.392601 0.096284 0.124457 0.284813 0.220714 0.304371 0.232333 0.234829 0.349979 0.370428 0.377429 0.348262 0.394266
chargesum: 0.00000
title: Mulliken charges with hydrogens summed into heavy atoms:
elementType: O O O O O O O C C C C C C
charge: -0.088996 -0.104672 -0.098798 -0.101486 -0.163017 0.023648 -0.194634 0.152353 0.154681 0.125618 0.074562 0.096284 0.124457
polarizability: 1.20552556e+02 -2.45854163e+00 8.91093323e+01 -4.23507970e+00 1.24818176e+00 6.60534812e+01
1716.lowfreq: -10.5400 -5.5731 -0.0010 -0.0008 -0.0003 4.4973 27.6701 43.5021 52.2392
frequency: 27.6587 43.4466 52.2188 77.8047 103.1399 110.3256 141.8252 205.7697 235.6621 259.6314 282.0820 303.2140 333.0291 358.5533 371.0599 423.7555 439.8844 467.4575 516.0072 519.9590 564.5556 576.4400 620.8131 627.6352 673.7926 742.5795 836.0961 857.6556 891.6297 940.4148 966.8137 1007.2112 1020.2652 1042.9489 1048.5118 1081.0717 1129.7731 1133.6715 1186.4819 1220.2098 1238.3458 1285.2403 1290.7990 1304.6637 1318.7644 1327.2117 1348.8208 1356.3607 1367.3385 1397.9649 1453.0742 1603.7725 1623.3246 2947.8322 2986.1124 3015.4983 3091.4811 3098.4545 3426.1990 3472.8408 3499.0085 3506.6288 3564.8643
redmass: 9.5308 7.1060 5.6808 8.1815 3.1941 6.0212 8.3538 6.5647 5.5370 5.8667 6.0722 1.1346 4.1465 5.6629 4.0717 3.2038 2.2880 1.8141 4.9227 1.1736 2.5099 1.3016 2.5903 2.0083 3.6116 4.2455 6.6517 2.6772 4.4166 4.8659 4.6874 3.2335 1.9349 4.1215 2.2841 3.3175 1.5877 1.4352 1.3853 1.3140 1.2063 1.3286 1.3170 1.2842 2.1138 1.2634 1.3971 1.2852 1.2108 1.6005 1.0810 10.7251 10.2796 1.0835 1.0816 1.0598 1.0899 1.1030 1.0644 1.0642 1.0651 1.0644 1.0664
irintensity: 1.9762 2.5132 2.9826 1.2431 5.1702 6.4429 2.1831 0.6963 5.4996 20.8872 21.5565 91.6569 37.2093 15.0030 14.8251 8.9579 91.1793 37.9791 1.5559 177.4102 64.7090 117.5347 129.9133 91.5751 58.1417 47.3146 10.6594 1.9267 56.5618 147.1479 97.4356 219.7889 12.9525 120.1676 61.3418 0.9645 3.2137 87.3130 11.9786 62.0556 5.8587 44.6899 74.9145 11.1629 25.8746 3.9662 44.5992 75.4350 18.5074 6.1957 6.5056 139.2405 154.9565 40.4036 26.8924 26.4157 1.4607 26.3037 37.5633 16.5303 29.2116 52.3398 10.5659
temp: 298.150 k
press: 1.00000 atm
elementType: 8 8 8 8 8 8 8 6 6 6 6 6 6 1 1 1 1 1 1 1 1 1 1
symmnumber: 1
zpe: 442412.9 jmol-1
zpe.correction: 0.168506 hartree
zpe.thermalcorrener: 0.182968 hartree
zpe.thermalcorrenthalpy: 0.183912 hartree
zpe.thermalcorrgfe: 0.125846 hartree
zpe.sumelectzpe: -760.123706 hartree
zpe.sumelectthermal: -760.109244 hartree
zpe.sumelectthermalent: -760.108300 hartree
zpe.sumelectthermalfe: -760.166367 hartree
dipole: 0.2913 0.3171 0.2730
dipole: 0.5099
quadrupole: -67.4524 -74.6087 -79.6940
quadrupole: 16.0930 1.3049 -1.9114
quadrupole: 6.4660 -0.6904 -5.7756 16.0930 1.3049 -1.9114
hfenergy: -760.2922122 hartree
pointgroup: C01 [X(C6H10O7)]
dipole: -0.1210853 0.1483408 -0.0597576 debye
dipolederiv: -0.6697909 -0.0494616 -0.0556685 0.0107886 -0.5364145 0.2656483 -0.1557372 0.2638899 -0.4359317 -0.3851725 -0.0431811 0.0152418 -0.1131968 -0.6716627 0.1203796 0.0620552 0.1464721 -0.6827857 -0.3545573 0.1169097 -0.0069065 0.1136443 -0.6264176 -0.1339414 -0.0624838 -0.1545662 -0.6506921 -1.0095247 -0.1440528 -0.0608517 -0.1731496 -0.1714801 0.063722 -0.0361497 0.089039 -0.555306 -0.751179 -0.0721327 0.0073077 -0.4282075 -0.5757811 -0.1259511 0.0452607 -0.1290497 -0.2990647 -1.2728203 0.0063016 0.2460463 0.1064635 -0.2287167 0.0348955 0.3515729 0.0468206 -0.4670394 -0.7400361 0.0249579 0.1284921 -0.2112183 -0.6726325 -0.0317135 0.0538791 -0.1339337 -0.3316799 0.6080303 -0.0065147 0.040538 0.113474 0.441597 -0.1459927 0.2783533 -0.1970554 0.3132025 0.0125439 -0.0005633 0.0049039 -0.031621 0.4836342 -0.0735043 -0.2604381 -0.0978452 0.273948 -0.6617127 -0.0379938 -0.0086394 -0.3177135 0.3707814 0.1308289 0.0630962 0.1602326 0.2223673 0.6781227 0.0810759 -0.113359 0.0540935 0.1934602 -0.0022858 0.0470181 0.0296326 0.2730123 1.1271222 0.079622 -0.0592157 0.4275656 0.4591925 0.0972029 -0.2692592 0.1123367 0.1898331 1.5714852 0.0908925 -0.3360136 0.1295853 0.6983367 0.0606074 -0.4245375 0.1492027 0.4027405 0.0756454 0.0080763 0.0224748 0.0083283 -0.0248255 -0.0353439 0.0448996 -0.0529511 0.0167976 0.0226005 0.0576155 0.0273123 0.0799597 -0.1519823 -0.0349198 0.0435712 -0.0597564 -0.0229325 0.230022 0.0546265 -0.0044101 0.1452097 0.0087342 -0.0002108 -0.0080016 0.0423421 0.0727735 0.0154316 0.0223559 -0.0104959 0.0143679 -0.0443517 0.1373958 -0.0098258 0.092944 -0.0095136 0.0142113 0.0363285 0.0559605 0.0256639 -0.0272475 -0.1071574 0.0445467 -0.0565659 0.028477 0.4008307 -0.0063872 0.0667362 -0.0047284 0.2343131 -0.0849759 0.1097271 -0.1604847 0.224039 0.1447667 -0.0721429 0.0520995 -0.0069336 0.3213789 0.0073946 0.0019495 -0.0106881 0.3906146 0.1998013 -0.1463738 -0.0697544 -0.0100746 0.3287492 0.0218252 -0.0164826 0.0709535 0.3774435 0.3572773 0.0365944 0.0589592 0.0831595 0.0491318 -0.074296 0.0939265 -0.0661287 0.3033186 0.3869024 -0.0365528 -0.0007574 -0.0154606 0.1422032 -0.0896077 0.0030597 -0.0848409 0.3663782 unknown
polarizability: 120.1669124|5.1252372|87.7284492|-3.5231027|6.0929907|67.8200078 unknown
InChI: InChI=1S/C6H10O7/c7-1-2(8)3(9)4(10)5(11)6(12)13/h2-4,7-10,12H,1H2
charge 0 multiplicity 1
23 atoms
O  -0.67698 1.439952 -1.242771
O  -1.96777 -1.138764 1.111412
O  0.025564 1.740629 1.396191
O  -4.38608 -0.728117 -0.236448
O  2.524689 1.477532 0.537254
O  3.660187 -0.655261 -0.731509
O  1.681382 -1.85517 -0.471017
C  -0.680576 0.258741 -0.38248
C  -2.084888 0.011528 0.208142
C  0.343939 0.454818 0.777665
C  -3.123514 -0.300307 -0.882757
C  1.800855 0.470488 0.329509
C  2.346892 -0.804764 -0.32669
H  -0.389173 -0.597562 -1.009931
H  -2.398714 0.911371 0.784008
H  0.18773 -0.378278 1.494077
H  -3.271063 0.564941 -1.555068
H  -2.807655 -1.177123 -1.472435
H  -0.681361 2.224752 -0.627958
H  -2.886008 -1.505683 1.222868
H  0.881196 2.246705 1.499381
H  -4.873932 0.069118 0.092071
H  3.98258 -1.498745 -1.153413
