program: Gaussian 09
title: 000167203
version: EM64L-G09RevD.01
frameworkgroup: C1[X(C9H14N)]
method: RPBEPBE
basis: SDD
operation: Freq
keyword: #p
keyword: freq=noraman
keyword: PBEPBE/SDD
title: #p freq=noraman PBEPBE/SDD
converged: YES YES NO NO
title: Mulliken charges:
elementType: N C C C C C C C C C H H H H H H H H H H H H H H
charge: -0.150563 0.342019 0.342009 0.462215 -0.410497 -0.410553 -0.632741 -0.778442 -0.778404 -0.774117 0.271470 0.271473 0.280090 0.280103 0.285092 0.268767 0.269673 0.271985 0.269674 0.268758 0.271982 0.254114 0.254129 0.271764
chargesum: 1.00000
title: Mulliken charges with hydrogens summed into heavy atoms:
elementType: N C C C C C C C C C
charge: -0.150563 0.342019 0.342009 0.462215 -0.139027 -0.139079 0.212544 0.031983 0.032010 0.005890
polarizability: 1.29600967e+02 2.12706096e-03 1.15822567e+02 1.15325883e+00 -2.64990040e-04 5.88632426e+01
1716.lowfreq: -5.0477 -0.0007 -0.0004 0.0001 9.0683 10.7974 30.9362 67.3913 101.8465
frequency: 30.7657 67.3889 101.8445 171.3700 195.1962 233.1187 235.1271 274.4648 321.3051 332.5492 412.7119 451.9260 498.1846 538.3900 542.6877 557.3171 572.4375 715.0769 730.2721 869.6354 910.4186 914.5825 962.2749 1015.0440 1024.7112 1035.8126 1044.7273 1047.1946 1049.3921 1113.7073 1124.7436 1146.8196 1198.1511 1272.0474 1324.5027 1333.6538 1401.3402 1408.1875 1409.5387 1420.4445 1423.9115 1443.9043 1453.9622 1463.9838 1470.4386 1472.4530 1478.7115 1488.4421 1490.6470 1510.7923 1567.7194 1638.5621 2987.5928 2991.5872 2991.6134 3027.6692 3071.5329 3071.9890 3073.9445 3113.4152 3122.8984 3123.1819 3137.2841 3167.8559 3173.9217 3176.2844
redmass: 1.0170 1.0684 2.4842 2.7671 2.4560 1.1308 1.1109 2.5258 2.9662 2.7489 2.3802 5.0305 3.0328 3.0497 2.9168 3.8590 4.2199 3.1698 3.8989 1.2373 2.5588 1.3174 3.4847 1.4335 1.6381 1.3909 1.6053 1.5977 1.5696 1.4308 1.8556 4.5507 1.6856 1.4301 3.9155 4.5544 1.1840 1.3846 1.2831 1.6434 1.6202 1.1272 1.0848 1.1158 1.0891 1.0944 1.2596 1.0813 1.4771 1.1141 5.6841 6.0242 1.0420 1.0413 1.0412 1.0402 1.0963 1.0963 1.0913 1.1012 1.0978 1.0976 1.0957 1.1024 1.0933 1.0946
irintensity: 0.9400 0.1504 0.8675 6.0720 0.0152 0.3255 0.1833 0.1935 2.2614 0.9528 0.3365 0.6481 0.0015 0.0393 4.1020 0.6365 0.3237 2.6808 2.7563 18.0118 2.0248 0.0409 0.1063 0.2514 5.6373 0.8892 9.3612 26.4719 0.7432 4.1270 5.8114 9.1956 1.6857 0.0014 5.9434 5.8967 50.3478 13.4429 24.0027 2.1174 16.8795 38.7897 0.8325 3.7780 19.0102 63.8816 9.3175 13.8450 64.3809 9.8868 94.4648 157.9498 0.4782 0.0901 1.1489 2.7524 0.3978 5.0813 6.9594 5.2215 5.0523 2.2458 4.0399 0.6899 0.3842 0.1637
temp: 298.150 k
press: 1.00000 atm
elementType: 7 6 6 6 6 6 6 6 6 6 1 1 1 1 1 1 1 1 1 1 1 1 1 1
symmnumber: 1
zpe: 551139.7 jmol-1
zpe.correction: 0.209918 hartree
zpe.thermalcorrener: 0.220929 hartree
zpe.thermalcorrenthalpy: 0.221873 hartree
zpe.thermalcorrgfe: 0.173029 hartree
zpe.sumelectzpe: -405.135742 hartree
zpe.sumelectthermal: -405.124731 hartree
zpe.sumelectthermalent: -405.123787 hartree
zpe.sumelectthermalfe: -405.172631 hartree
dipole: -1.5753 0.0001 0.1019
dipole: 1.5786
quadrupole: -33.3501 -39.8974 -59.9079
quadrupole: 0.0005 0.2718 0.0000
quadrupole: 11.0350 4.4878 -15.5228 0.0005 0.2718 0.0000
hfenergy: -405.3456602 hartree
pointgroup: C01 [X(C9H14N1)]
dipole: -0.6195939 0.0001054 0.0427831 debye
dipolederiv: -0.4595498 0.0000083 -0.0146823 0.0000478 -0.3503039 0.0000061 0.0524949 -0.000001 -0.0659356 0.5120184 -0.4324977 0.0077666 -0.0048848 0.4315162 -0.0085557 -0.0227834 0.0149916 0.0563727 0.5121428 0.4325047 0.0077507 0.0048662 0.4314284 0.0085415 -0.0227959 -0.0150086 0.0563863 0.8979925 -0.0000125 0.0359112 0.0000134 0.4071132 -0.0000084 0.0902174 -0.0000144 0.0710406 -0.5162744 0.4710533 -0.0058399 0.2833658 -0.1910076 0.0146003 -0.0103083 0.0082085 -0.1142792 -0.5164623 -0.4709975 -0.0058307 -0.2833032 -0.1908577 -0.0145942 -0.0102993 -0.0081995 -0.114257 0.320814 -0.0000235 0.0226839 -0.000067 0.0635581 -0.0000001 -0.0418309 0.0000074 0.1317717 -0.1173572 0.2029122 0.0017797 0.0912868 -0.1689123 -0.0063196 0.0306783 -0.0525498 0.0240651 -0.117431 -0.2029353 0.0017892 -0.0913107 -0.168864 0.0063264 0.0307173 0.0525792 0.0240548 -0.3914285 -0.0000106 -0.0465348 -0.0002497 0.0324196 0.0000025 -0.2381949 0.0000201 -0.0173759 0.0887442 -0.0330372 0.0020368 -0.0345563 0.0142031 0.0014631 0.0029375 0.007863 0.1496351 0.0887547 0.033024 0.0020364 0.0345395 0.014189 -0.0014611 0.0029349 -0.0078628 0.1496372 0.0795849 -0.0006911 -0.0168212 -0.0650527 0.0185878 0.083349 0.01288 0.0619001 0.0870465 0.079633 0.0006801 -0.0168313 0.0650745 0.018513 -0.0832935 0.0128513 -0.0618561 0.0871237 0.0304749 0.0000107 0.0036549 -0.0000084 0.1330597 -0.0000524 -0.0297068 -0.0000445 -0.02336 0.0467778 0.0060235 -0.0851533 -0.0001507 0.0727896 -0.0491289 -0.0917206 -0.0059229 0.0331827 0.0794784 0.0272211 0.0711178 0.0219371 0.0866483 0.0327673 0.0683691 0.0152485 -0.0005954 0.0155751 -0.1251991 0.0222111 -0.0408186 0.0492296 0.0136188 0.0083189 0.0262177 0.131283 0.0794887 -0.0272173 0.0711056 -0.0219378 0.0866634 -0.0327815 0.0683543 -0.0152621 -0.0006043 0.0467691 -0.006007 -0.0851466 0.0001643 0.0727932 0.0491495 -0.0917278 0.00593 0.0331939 0.0156141 0.1251949 0.0222177 0.0408248 0.0491948 -0.0136291 0.0083137 -0.0262288 0.1312819 0.072883 -0.0003725 0.0095758 0.030464 -0.0250985 -0.0833047 0.0786141 -0.0645831 0.0964234 0.072893 0.0003596 0.0096047 -0.0303167 -0.0249439 0.0833995 0.0786728 0.0646498 0.0963208 0.0788644 0.000009 -0.014402 0.0000722 0.1380808 -0.0000948 0.0130134 -0.0000822 -0.022412 unknown
polarizability: 129.6096421|0.0006855|115.8225667|0.8463377|-0.0011168|58.8545677 unknown
InChI: InChI=1S/C9H14N/c1-7-5-8(2)10(4)9(3)6-7/h5-6H,1-4H3
charge 1 multiplicity 1
24 atoms
N  -1.097677 0.000149 0.024261
C  -0.415268 1.216819 -0.000317
C  -0.415546 -1.216673 -0.000285
C  1.730919 -0.000176 -0.015133
C  0.989146 1.207542 -0.017078
C  0.988874 -1.207721 -0.017047
C  -2.592165 0.000308 0.036281
C  -1.189492 2.51031 -0.015195
C  -1.190055 -2.509993 -0.015129
C  3.237505 -0.000333 0.00024
H  1.507689 2.169644 -0.036446
H  1.507194 -2.169942 -0.036392
H  -2.962928 -0.8883 0.562175
H  -2.962741 0.889298 0.561652
H  -2.980253 0.00005 -0.996733
H  -1.941648 2.54177 -0.823246
H  -1.716441 2.689822 0.941222
H  -0.498507 3.352289 -0.168716
H  -1.71697 -2.689401 0.941329
H  -1.942287 -2.541274 -0.823114
H  -0.499269 -3.352122 -0.168715
H  3.653622 -0.896291 -0.488951
H  3.6538 0.895111 -0.48975
H  3.605998 0.000114 1.045086
