program: Gaussian 09
title: 000167216
version: EM64L-G09RevD.01
frameworkgroup: C1[X(C13H12N2O)]
method: RPBEPBE
basis: SDD
operation: Freq
keyword: #p
keyword: freq=noraman
keyword: PBEPBE/SDD
title: #p freq=noraman PBEPBE/SDD
converged: YES YES NO NO
title: Mulliken charges:
elementType: O N N C C C C C C C C C C C C C H H H H H H H H H H H H
charge: -0.322282 -0.677292 -0.687442 0.159099 0.302898 0.059952 0.299276 -0.356292 -0.356453 -0.352130 0.492527 -0.415256 -0.428129 -0.417755 -0.295852 -0.205324 0.270340 0.265171 0.267266 0.216518 0.219546 0.218777 0.226988 0.223236 0.378469 0.294765 0.310053 0.309325
chargesum: 0.00000
title: Mulliken charges with hydrogens summed into heavy atoms:
elementType: O N N C C C C C C C C C C C C C
charge: -0.322282 -0.004058 -0.068063 0.159099 0.302898 0.059952 0.299276 -0.085952 -0.091281 -0.084865 0.492527 -0.198738 -0.208583 -0.198978 -0.068863 0.017912
polarizability: 2.87142682e+02 5.63981365e+00 1.66688935e+02 9.91326129e+00 -3.71401865e+00 8.00275740e+01
1716.lowfreq: -7.7473 -3.3736 -1.6961 0.0004 0.0006 0.0007 46.2844 62.3384 75.0829
frequency: 46.2641 62.3068 75.0635 127.4254 169.8473 216.6722 236.2885 257.3253 302.8901 374.9346 392.2643 395.9525 404.0499 413.9942 429.9744 434.2154 476.9010 492.2589 526.5308 537.6788 561.8577 610.2731 634.6760 676.8133 681.8694 734.6311 760.7277 767.8043 805.5349 809.0391 819.7876 827.0026 841.8734 852.3461 915.8163 950.0737 965.3674 970.5700 985.2186 1000.9934 1019.1040 1025.0810 1058.0390 1132.9102 1139.6688 1162.7503 1174.9630 1192.1718 1279.6320 1306.0315 1312.5316 1325.4084 1333.4895 1378.5700 1400.7975 1415.3088 1443.9485 1468.1722 1506.7833 1516.9993 1559.1057 1571.7466 1587.7587 1626.1229 1628.6643 1644.3607 3116.1583 3119.6865 3122.6003 3136.4316 3148.5827 3154.0347 3159.6020 3169.5763 3328.5269 3561.6863 3633.3404 3701.8003
redmass: 4.7745 4.3382 4.5135 6.8770 4.4554 4.8321 5.1020 4.8496 4.9245 2.9187 4.1733 1.3959 1.0770 2.9563 2.9302 3.0143 1.2877 4.2894 3.3252 3.3067 5.9899 5.7941 6.6121 3.6532 5.5799 2.8062 1.4936 2.0541 4.0567 1.5557 1.3097 5.0657 1.9866 1.5150 5.9345 1.3997 1.3513 1.3565 1.2825 2.7970 1.4784 2.0825 1.7493 1.2333 2.0275 1.6593 1.0746 1.1645 1.8466 2.2787 1.4867 2.8047 2.4858 4.1500 6.2584 3.5524 3.9771 2.4709 4.4635 3.1672 3.5265 6.7976 1.6084 6.3365 3.5756 1.3598 1.0864 1.0887 1.0888 1.0897 1.0934 1.0943 1.0955 1.0990 1.0595 1.0450 1.0914 1.1040
irintensity: 4.5440 1.1242 1.6421 1.8854 0.4369 1.1647 0.7177 4.3541 10.9312 2.9947 45.2907 185.8300 81.0424 4.0520 17.9318 8.5371 107.2248 5.7094 3.9065 24.4605 3.4830 47.8261 1.3972 22.4643 1.7697 29.9232 91.3552 35.2936 2.1290 100.1306 5.0822 6.4185 56.0906 2.5209 41.1688 0.6158 2.8655 3.7829 0.0928 0.0720 0.7112 8.2688 8.6494 19.8247 11.3614 5.2501 58.7615 93.8189 152.9401 175.7514 17.9571 228.5153 96.8844 16.6818 12.8582 42.1629 5.4421 43.1841 258.1486 4.7807 41.0404 61.3497 268.3982 180.6490 140.2731 354.5340 10.7473 13.6396 30.9085 17.7157 31.4435 6.4334 7.3419 19.1527 120.4138 123.7040 58.9139 22.4023
temp: 298.150 k
press: 1.00000 atm
elementType: 8 7 7 6 6 6 6 6 6 6 6 6 6 6 6 6 1 1 1 1 1 1 1 1 1 1 1 1
symmnumber: 1
zpe: 580830.4 jmol-1
zpe.correction: 0.221227 hartree
zpe.thermalcorrener: 0.234715 hartree
zpe.thermalcorrenthalpy: 0.235660 hartree
zpe.thermalcorrgfe: 0.181151 hartree
zpe.sumelectzpe: -686.217757 hartree
zpe.sumelectthermal: -686.204269 hartree
zpe.sumelectthermalent: -686.203325 hartree
zpe.sumelectthermalfe: -686.257833 hartree
dipole: -2.5558 -2.2475 0.5797
dipole: 3.4524
quadrupole: -52.5001 -89.2908 -97.2502
quadrupole: 7.5601 3.5958 -1.8543
quadrupole: 27.1803 -9.6104 -17.5698 7.5601 3.5958 -1.8543
hfenergy: -686.438984 hartree
pointgroup: C01 [X(C13H12N2O1)]
dipole: 0.8891907 0.9411329 -0.4105128 debye
polarizability: 281.264258|5.4589172|144.8525241|-31.3230635|-40.0384217|107.742409 unknown
InChI: InChI=1S/C13H12N2O/c14-10-7-5-9(6-8-10)13(16)11-3-1-2-4-12(11)15/h1-8H,14-15H2
charge 0 multiplicity 1
28 atoms
O  -0.14984 -1.909224 1.389506
N  -2.665928 -1.484383 2.013308
N  5.02652 1.186118 -0.747594
C  -1.454465 -0.189817 0.304054
C  1.143318 -0.258893 0.243891
C  -0.168724 -0.83274 0.670471
C  -2.669612 -0.525204 1.023163
C  1.396795 1.136289 0.117632
C  2.238881 -1.151035 0.064987
C  -1.548934 0.731842 -0.782828
C  3.759557 0.715263 -0.415905
C  -3.881724 0.159519 0.68848
C  2.677882 1.619293 -0.198057
C  3.516361 -0.685447 -0.273565
C  -2.753908 1.365538 -1.123905
C  -3.920761 1.087874 -0.360142
H  0.594207 1.854367 0.314542
H  2.057398 -2.221873 0.203898
H  -0.655591 0.920044 -1.385983
H  -4.793213 -0.075036 1.252297
H  2.852151 2.700177 -0.266147
H  4.338354 -1.395986 -0.424767
H  -2.796793 2.057214 -1.970968
H  -4.866654 1.585106 -0.605089
H  -1.794567 -2.02381 2.130909
H  -3.510493 -1.680518 2.545044
H  5.801285 0.543582 -0.88584
H  5.204796 2.18164 -0.844291
