program: Gaussian 09
title: 000167087
version: EM64L-G09RevD.01
frameworkgroup: C*V[C*(HBr)]
method: RPBEPBE
basis: SDD
operation: Freq
keyword: #p
keyword: freq=noraman
keyword: PBEPBE/SDD
title: #p freq=noraman PBEPBE/SDD
converged: YES YES YES YES
title: Mulliken charges:
elementType: Br H
charge: -0.130979 0.130979
chargesum: 0.00000
title: Mulliken charges with hydrogens summed into heavy atoms:
elementType: Br
charge: 0.000000
polarizability: 7.40885618e-01 9.69855157e-13 7.40885618e-01 -3.92786711e-11 -3.35925610e-11 1.72767491e+01
1716.lowfreq: 0.0000 0.0000 0.0000 76.6573 76.6573 2390.0840
frequency: 2390.0840
redmass: 1.0205
irintensity: 2.6934
temp: 298.150 k
press: 1.00000 atm
elementType: 35 1
symmnumber: 1
zpe: 14295.9 jmol-1
zpe.correction: 0.005445 hartree
zpe.thermalcorrener: 0.007806 hartree
zpe.thermalcorrenthalpy: 0.008750 hartree
zpe.thermalcorrgfe: -0.013835 hartree
zpe.sumelectzpe: -13.959068 hartree
zpe.sumelectthermal: -13.956707 hartree
zpe.sumelectthermalent: -13.955763 hartree
zpe.sumelectthermalfe: -13.978348 hartree
dipole: 0.0000 0.0000 -1.3390
dipole: 1.3390
quadrupole: -16.8586 -16.8586 -12.5451
quadrupole: 0.0000 0.0000 0.0000
quadrupole: -1.4378 -1.4378 2.8756 0.0000 0.0000 0.0000
hfenergy: -13.9645127 hartree
pointgroup: C*V [C*(H1Br1)]
dipole: 0.2443921 -0.0828199 -0.4592655 debye
dipolederiv: -0.1379339 -0.0176925 -0.0981112 -0.0176925 -0.1841468 0.033248 -0.0981112 0.033248 -0.0057704 0.1379339 0.0176925 0.0981112 0.0176925 0.1841468 -0.033248 0.0981112 -0.033248 0.0057704 unknown
polarizability: 4.2998225|-1.2060564|1.1495953|-6.688011|2.2664404|13.3091025 unknown
InChI: InChI=1S/BrH/h1H
charge 0 multiplicity 1
2 atoms
Br -0.003528 0.001196 0.00663
H  0.676628 -0.229296 -1.27153
