program: Gaussian 09
title: 000167013
version: EM64L-G09RevD.01
frameworkgroup: C*V[C*(HCl)]
method: RPBEPBE
basis: SDD
operation: Freq
keyword: #p
keyword: freq=noraman
keyword: PBEPBE/SDD
title: #p freq=noraman PBEPBE/SDD
converged: NO NO YES YES
title: Mulliken charges:
elementType: Cl H
charge: -0.210499 0.210499
chargesum: 0.00000
title: Mulliken charges with hydrogens summed into heavy atoms:
elementType: Cl
charge: 0.000000
polarizability: 2.35692633e+00 -2.05626135e-11 2.35692633e+00 5.64998701e-11 -1.47373036e-11 1.32414109e+01
1716.lowfreq: -101.4023 -101.4023 -0.0037 -0.0037 -0.0019 2638.3670
frequency: 2638.3670
redmass: 1.0360
irintensity: 0.2029
temp: 298.150 k
press: 1.00000 atm
elementType: 17 1
symmnumber: 1
zpe: 15780.9 jmol-1
zpe.correction: 0.006011 hartree
zpe.thermalcorrener: 0.008371 hartree
zpe.thermalcorrenthalpy: 0.009315 hartree
zpe.thermalcorrgfe: -0.011933 hartree
zpe.sumelectzpe: -460.558869 hartree
zpe.sumelectthermal: -460.556509 hartree
zpe.sumelectthermalent: -460.555564 hartree
zpe.sumelectthermalfe: -460.576813 hartree
dipole: 0.0000 0.0000 -1.7644
dipole: 1.7644
quadrupole: -13.7341 -13.7341 -10.3888
quadrupole: 0.0000 0.0000 0.0000
quadrupole: -1.1151 -1.1151 2.2302 0.0000 0.0000 0.0000
hfenergy: -460.5648798 hartree
pointgroup: C*V [C*(H1Cl1)]
dipole: 0.3220539 -0.1091411 -0.6051939 debye
dipolederiv: -0.2146172 -0.021275 -0.1179711 -0.021275 -0.2701856 0.0399793 -0.1179711 0.0399793 -0.0557079 0.2146172 0.021275 0.1179711 0.021275 0.2701856 -0.0399793 0.1179711 -0.0399793 0.0557079 unknown
polarizability: 4.6996283|-0.7939202|2.6259786|-4.4023336|1.4919105|10.6296567 unknown
InChI: InChI=1S/ClH/h1H
charge 0 multiplicity 1
2 atoms
Cl -0.004373 0.001482 0.008218
H  0.610173 -0.206782 -1.146618
