program: Gaussian 09
title: 000167000
version: EM64L-G09RevD.01
frameworkgroup: C1[X(C10H8N2O4)]
method: RPBEPBE
basis: SDD
operation: Freq
keyword: #p
keyword: freq=noraman
keyword: PBEPBE/SDD
title: #p freq=noraman PBEPBE/SDD
converged: YES YES NO YES
title: Mulliken charges:
elementType: O O O O N N C C C C C C C C C C H H H H H H H H
charge: -0.210574 -0.297117 -0.241348 -0.182660 -0.048184 0.018439 0.254215 0.183578 0.157370 0.290442 -0.335643 -0.380589 -0.359130 -0.244286 -0.214618 -0.536299 0.316538 0.305134 0.302938 0.239501 0.242945 0.234255 0.234264 0.270829
chargesum: 0.00000
title: Mulliken charges with hydrogens summed into heavy atoms:
elementType: O O O O N N C C C C C C C C C C
charge: -0.210574 -0.297117 -0.241348 -0.182660 -0.048184 0.018439 0.254215 0.183578 0.157370 0.290442 -0.019105 -0.075456 -0.056192 -0.004785 0.028327 0.203049
polarizability: 2.23082296e+02 8.37124598e-01 1.91379821e+02 3.84234339e-02 1.20049862e-02 5.66555915e+01
1716.lowfreq: -73.7585 -6.2557 -0.0008 -0.0003 0.0003 4.6012 8.5180 40.5496 91.5626
frequency: -73.7571 40.5327 91.5510 121.0688 179.0124 205.8015 206.9560 258.8050 271.2241 307.7128 328.8635 345.0657 367.4416 390.6203 428.1221 457.5142 518.9872 525.5606 611.9508 620.4486 626.8685 632.2110 669.3396 703.4910 744.7722 746.5795 785.4125 804.0597 826.6045 878.5086 896.0610 982.1425 991.7332 1011.5898 1034.1999 1065.8655 1093.2973 1103.5905 1147.4782 1158.7172 1171.3629 1180.8517 1193.4055 1244.2395 1277.5100 1317.4812 1341.5272 1358.7050 1385.4322 1424.5387 1435.7220 1454.7547 1466.3603 1476.6838 1495.5007 1531.0232 1579.7101 1615.2242 2976.4933 3076.3783 3144.7103 3146.2446 3164.5138 3188.5005 3228.4310 3230.0550
redmass: 14.2519 6.5439 3.9200 4.0351 5.4127 3.6293 2.0713 9.2578 1.5691 7.0798 11.6641 6.5690 6.2625 10.8605 3.5353 6.4405 3.6785 7.1999 9.7866 5.7911 3.9083 6.8655 6.0414 6.9206 8.1626 4.6090 1.3539 5.9348 1.6334 8.0672 1.3840 9.0929 1.3422 1.3216 2.6835 2.9331 3.6462 1.2515 1.5299 2.2184 1.3518 3.5785 2.3971 2.2862 3.0213 4.6697 2.4227 8.3917 4.0083 2.6488 1.4809 2.0675 1.1082 1.0496 5.3876 4.8343 6.7945 6.5638 1.0321 1.1054 1.0881 1.1007 1.0937 1.0964 1.0927 1.0911
irintensity: 0.0010 7.2697 0.6204 1.3910 4.1917 6.2135 1.6964 4.7410 1.0698 5.8432 1.5503 0.7610 0.7778 6.5811 6.0233 5.1547 4.6124 0.1854 17.6944 3.5732 3.2497 9.1383 3.4441 0.6549 6.9509 0.5270 99.5781 9.7476 35.0266 10.1776 0.0899 30.5146 5.6490 0.4996 36.4365 9.1336 30.7840 0.0641 6.5666 259.0623 25.4093 273.8454 13.0376 86.3404 139.7629 3.0907 4.2228 90.0894 9.2218 30.7640 7.5792 29.9204 57.9748 17.2689 39.3726 213.3470 76.4693 13.8482 49.0080 31.1030 8.6151 9.2872 13.7384 7.2022 15.6384 1.6807
temp: 298.150 k
press: 1.00000 atm
elementType: 8 8 8 8 7 7 6 6 6 6 6 6 6 6 6 6 1 1 1 1 1 1 1 1
symmnumber: 1
zpe: 444323.7 jmol-1
zpe.correction: 0.169234 hartree
zpe.thermalcorrener: 0.181566 hartree
zpe.thermalcorrenthalpy: 0.182511 hartree
zpe.thermalcorrgfe: 0.130409 hartree
zpe.sumelectzpe: -794.966691 hartree
zpe.sumelectthermal: -794.954358 hartree
zpe.sumelectthermalent: -794.953414 hartree
zpe.sumelectthermalfe: -795.005516 hartree
dipole: 0.6714 -3.6930 0.0001
dipole: 3.7535
quadrupole: -74.5029 -106.0092 -92.5624
quadrupole: 21.8993 -0.0156 -0.0081
quadrupole: 16.5219 -14.9844 -1.5376 21.8993 -0.0156 -0.0081
hfenergy: -795.1359247 hartree
pointgroup: C01 [X(C10H8N2O4)]
dipole: 0.2915862 -1.4476702 0.0000562 debye
dipolederiv: -1.651258 -0.6876301 0.0003096 -0.2486539 -0.2673065 -0.0001 0.0003084 0.000123 -0.2573211 -0.5012419 0.27301 0.000017 0.2623098 -1.0577477 0.0000263 -0.0000087 0.0000105 -0.2779948 -0.4958676 -0.2556155 -0.0011254 -0.0602367 -0.9687908 -0.0011958 -0.000932 -0.001143 -0.2533506 -0.9225248 0.314765 -0.0015744 0.1929757 -0.4969173 0.0000117 -0.0018153 -0.0000137 -0.2137451 0.7464714 -0.1658011 -0.0000279 -0.0933725 1.0877248 -0.0000312 -0.0000102 0.0000205 0.125031 1.240642 -0.3756911 0.0032042 -0.4104813 1.875853 0.0014827 0.0030844 0.0013478 0.1876342 0.4122726 -0.2121325 -0.0000485 0.2538914 0.0240133 -0.0000127 0.000226 -0.0006741 0.0753381 0.0472355 -0.2611874 0.0000274 -0.1222448 -0.4790284 0.0000236 0.0001167 -0.0000907 0.0165384 -0.4307607 0.2742514 -0.0004097 0.1850145 -0.9663896 -0.0001516 -0.0002348 -0.0000622 -0.020086 1.4421981 0.4969297 -0.0003743 -0.3654724 0.4719451 0.000033 -0.0006942 0.0005782 0.1782572 -0.3831309 0.055359 -0.000039 -0.0877657 0.0621753 -0.0000131 -0.0000177 0.0000223 -0.1464711 -0.6834364 0.2444266 0.0000806 0.3293923 -0.0586118 -0.0000732 0.0000346 0.00002 -0.1846761 -0.0469967 0.1911633 -0.0000275 -0.0884701 0.0226565 0.0000345 -0.0000059 0.0000646 -0.1231498 0.1115607 -0.0110912 -0.0000323 0.0788616 0.2963015 -0.000024 -0.0000858 0.0001567 -0.1203192 0.1329899 -0.1391946 -0.0000056 -0.0557414 -0.2300122 0.0000184 0.00007 0.0000202 -0.1456304 0.640715 0.2436868 -0.0000533 0.5168895 0.4580786 -0.0001068 -0.0001015 -0.0001808 0.3050718 0.1957265 0.0694736 0.0000738 -0.047618 0.0723299 0.0000255 -0.0000313 -0.0001604 0.1734709 0.0692333 -0.0031455 -0.0000069 -0.0227736 0.0559173 0.0000098 0.0000617 -0.0000404 0.1832903 0.1401209 -0.0378207 -0.0000029 0.0678888 0.04441 -0.0000039 -0.0000353 0.0000106 0.1753365 0.0105714 -0.0919412 0.000024 -0.1073766 -0.0213746 0.0000177 -0.0000163 -0.000006 0.1532662 -0.1030828 0.0242836 0.0000019 0.0298827 0.0902867 0.0000027 0.0000032 -0.0000427 0.1597776 0.0590751 0.027449 -0.0774687 -0.1357605 -0.050895 0.081488 -0.0175615 0.091391 -0.0614097 0.0591565 0.0274359 0.0774076 -0.1356961 -0.050957 -0.0814692 0.0176138 -0.0913682 -0.0613654 -0.0896691 -0.0009831 0.0000502 0.0645575 0.0863391 0.0000076 0.0000315 0.0000167 0.1325073 unknown
polarizability: 223.0392533|1.4364877|191.4228637|0.0381893|0.0127301|56.6555915 unknown
InChI: InChI=1S/C10H8N2O4/c1-16-9-6-11(13)8-5-3-2-4-7(8)10(9)12(14)15/h2-6H,1H3
charge 0 multiplicity 1
24 atoms
O  -2.896192 -0.449269 0.000013
O  1.020007 -3.128418 -0.000015
O  -0.672744 3.078487 0.003227
O  -2.690501 2.052436 -0.003672
N  0.480403 -1.91844 -0.000047
N  -1.399018 1.996719 -0.000233
C  0.721403 0.559693 0.000048
C  1.314022 -0.758046 0.000013
C  -0.731627 0.687246 -0.000133
C  -1.517323 -0.510212 -0.0002
C  1.661761 1.649944 -0.000054
C  -0.879063 -1.77502 -0.000125
C  2.714766 -0.981997 -0.000008
C  3.043224 1.42563 -0.000138
C  3.585134 0.109715 -0.000069
C  -3.6762 -1.70339 0.000422
H  1.274823 2.665918 0.000053
H  -1.424599 -2.716479 -0.0001
H  3.06259 -2.017466 -0.000012
H  3.716045 2.289874 -0.000217
H  4.668366 -0.046049 -0.000091
H  -3.475089 -2.299616 0.909732
H  -3.475447 -2.299944 -0.908748
H  -4.719442 -1.360117 0.000556
