program: Gaussian 09
title: 000167004
version: EM64L-G09RevD.01
frameworkgroup: C1[X(C19H15N3O4)]
method: RPBEPBE
basis: SDD
operation: Freq
keyword: #p
keyword: freq=noraman
keyword: PBEPBE/SDD
title: #p freq=noraman PBEPBE/SDD
converged: YES YES NO NO
title: Mulliken charges:
elementType: O O O O N N N C C C C C C C C C C C C C C C C C C C H H H H H H H H H H H H H H H
charge: -0.293584 -0.293397 -0.244774 -0.245278 0.005368 0.000894 0.000798 0.043855 0.047274 -0.324624 -0.326446 -0.329405 -0.329187 -0.155188 0.210880 0.210619 0.232486 0.231865 -0.256420 -0.256452 -0.414114 -0.415673 -0.180515 -0.180546 -0.318080 -0.317928 0.262537 0.260665 0.262775 0.259972 0.264373 0.264886 0.243447 0.280478 0.280445 0.267986 0.270101 0.240237 0.240234 0.249741 0.249696
chargesum: 0.00000
title: Mulliken charges with hydrogens summed into heavy atoms:
elementType: O O O O N N N C C C C C C C C C C C C C C C C C C C
charge: -0.293584 -0.293397 -0.244774 -0.245278 0.005368 0.000894 0.000798 0.043855 0.047274 0.198578 0.196300 -0.065032 -0.064301 0.088259 0.210880 0.210619 0.232486 0.231865 0.024057 0.023994 -0.146128 -0.145572 0.059721 0.059688 -0.068339 -0.068232
polarizability: 3.75456131e+02 -2.60271497e-01 2.40036853e+02 -1.28193267e+00 2.78051855e-01 1.00853011e+02
1716.lowfreq: -7.2133 -2.1594 -0.0009 -0.0006 0.0007 1.0575 5.9053 10.0864 13.1762
frequency: -3.7305 9.3363 12.6914 24.1931 27.6409 53.7808 58.4153 61.6445 106.5797 109.2647 113.9998 165.1168 174.4634 190.4919 193.1986 202.8679 204.8226 252.3396 273.1410 315.4771 375.2052 375.4906 382.8917 421.8600 426.2277 430.7361 431.6500 496.2519 522.1480 534.7088 578.7199 583.1380 609.4585 610.3764 678.2208 690.8004 696.3138 696.7276 717.9751 718.5653 736.0481 742.4175 791.2074 818.7924 833.2437 833.6754 834.5094 884.9673 923.3873 930.8751 935.4605 937.5499 965.5485 966.0914 967.3594 976.2833 986.8025 997.1275 1000.8517 1004.3008 1007.0581 1007.5626 1010.2007 1023.7846 1024.3379 1076.8384 1079.6196 1081.9906 1108.9159 1108.9860 1169.8893 1195.1785 1196.5722 1197.1927 1197.3751 1232.6740 1246.3029 1248.0424 1278.2505 1312.0787 1312.2319 1320.4364 1325.8186 1327.5678 1332.2403 1354.7027 1408.3656 1408.7262 1415.4807 1445.7216 1454.2302 1455.3979 1456.9773 1463.2196 1550.7061 1550.8036 1577.9728 1585.4415 1585.5906 1588.7534 1622.1962 1624.1740 3009.5724 3010.2112 3070.1723 3071.2262 3137.3522 3137.4297 3148.0787 3155.2715 3155.4035 3162.1279 3162.2187 3175.5484 3175.7515 3185.1264 3191.5311
redmass: 6.7489 6.1329 5.0690 4.9183 5.9949 6.4572 6.7310 6.8850 7.5538 5.2513 3.8811 6.7700 4.6515 5.0663 3.0821 4.4834 2.6495 8.4544 7.2256 6.8091 2.8785 2.8826 7.6972 7.3626 3.4868 4.7773 4.9140 7.5102 4.9083 3.6416 5.9615 7.2510 7.8250 7.7599 8.0615 7.4871 7.1772 7.3178 1.8119 1.8167 3.7820 4.8858 1.2106 10.0214 1.8847 1.8072 4.6019 4.9250 1.3207 7.9717 1.3975 1.3877 1.6396 1.6434 3.8332 4.4498 1.8080 2.2929 3.6681 2.8147 1.3924 1.3887 1.4207 4.0962 3.9753 3.9912 1.8560 3.0645 1.6204 1.6244 1.1022 1.0876 1.1262 1.3079 1.2505 1.9705 2.9189 2.4814 2.8006 10.6453 10.9167 4.3605 1.4302 1.3000 1.8196 1.7231 2.1552 2.1389 2.9247 1.5953 1.4325 2.1743 1.4525 1.4991 5.9106 5.9181 7.2142 5.9158 5.9213 5.8223 11.6801 11.1877 1.0575 1.0576 1.1050 1.1048 1.0889 1.0888 1.0897 1.0915 1.0914 1.0923 1.0923 1.1004 1.1004 1.0928 1.0980
irintensity: 0.1622 0.2485 1.5684 0.1354 0.5635 0.2276 5.8588 0.0904 0.2442 0.3263 0.1495 0.4736 0.0416 0.9103 0.4205 0.3452 27.7604 23.0772 0.2635 33.7314 0.4237 0.4178 0.4885 3.8968 0.1818 5.2432 1.0524 2.4472 7.3900 12.7422 7.0939 2.4240 0.3956 2.1370 3.3818 0.8136 12.4739 0.3171 51.1500 60.3714 1.1636 0.5010 65.7059 13.5497 29.0166 11.7849 17.7453 10.6626 0.9232 4.7639 2.0606 2.0000 1.6174 0.5725 1.6122 0.2245 1.5447 52.9221 17.0754 30.1871 0.9257 0.7909 2.7559 0.5656 38.1869 842.2236 2.9440 5.6993 6.7919 7.3362 3.6660 0.8564 2.0023 7.5361 8.8225 0.0660 884.6132 3.7645 7.8649 2.1594 1.2742 0.0185 0.4045 6.1109 6.6095 7.0593 13.5539 49.9866 0.3353 91.0791 51.5051 0.2098 0.7718 19.0562 0.3995 0.6216 81.9013 28.9627 29.0220 106.5594 7.2106 348.2218 8.5507 5.2930 5.8063 9.4093 11.4019 10.4421 6.6180 7.7891 7.0791 11.6513 8.5011 18.4793 15.4355 5.9706 4.7591
temp: 298.150 k
press: 1.00000 atm
elementType: 8 8 8 8 7 7 7 6 6 6 6 6 6 6 6 6 6 6 6 6 6 6 6 6 6 6 1 1 1 1 1 1 1 1 1 1 1 1 1 1 1
symmnumber: 1
zpe: 798567.5 jmol-1
zpe.correction: 0.304158 hartree
zpe.thermalcorrener: 0.325826 hartree
zpe.thermalcorrenthalpy: 0.326770 hartree
zpe.thermalcorrgfe: 0.247995 hartree
zpe.sumelectzpe: -1196.342729 hartree
zpe.sumelectthermal: -1196.321061 hartree
zpe.sumelectthermalent: -1196.320117 hartree
zpe.sumelectthermalfe: -1196.398893 hartree
dipole: 0.0078 0.6974 0.7771
dipole: 1.0442
quadrupole: -101.0376 -167.2054 -151.5020
quadrupole: -0.2925 -1.0325 2.4993
quadrupole: 38.8774 -27.2904 -11.5870 -0.2925 -1.0325 2.4993
hfenergy: -1196.6468876 hartree
pointgroup: C01 [X(C19H15N3O4)]
dipole: -0.0021106 0.0802222 0.4028956 debye
polarizability: 375.4614188|0.2540028|150.6099535|0.4643301|-66.7093556|190.274623 unknown
InChI: InChI=1S/C19H15N3O4/c23-18(14-4-2-8-20-10-14)25-12-16-6-1-7-17(22-16)13-26-19(24)15-5-3-9-21-11-15/h1-11H,12-13H2
charge 0 multiplicity 1
41 atoms
O  -3.605171 0.235245 -0.377336
O  3.6048 0.221585 -0.405979
O  -4.934286 1.403357 -1.895844
O  4.938762 1.545882 -1.786893
N  -0.000094 0.657314 -0.929491
N  -6.871997 -1.334812 1.653849
N  6.864391 -1.515126 1.495244
C  -1.172046 0.363394 -0.294416
C  1.174557 0.376869 -0.293731
C  -2.405542 0.738879 -1.08963
C  2.405396 0.772134 -1.08343
C  -1.21728 -0.224754 0.990631
C  1.225718 -0.210585 0.991644
C  0.005782 -0.513815 1.636077
C  -5.98412 0.081488 -0.137429
C  5.981697 0.069626 -0.151641
C  -4.83494 0.646192 -0.900341
C  4.83554 0.694459 -0.871145
C  -7.298375 0.453763 -0.51938
C  7.295548 0.498624 -0.470238
C  -5.824269 -0.816242 0.951336
C  5.81933 -0.940669 0.833285
C  -8.389893 -0.075365 0.197215
C  8.384169 -0.087411 0.20528
C  -8.130883 -0.95942 1.272132
C  8.122759 -1.083224 1.176916
H  -2.483776 1.835184 -1.20893
H  -2.367863 0.297559 -2.101631
H  2.498681 1.871542 -1.155447
H  2.351919 0.374914 -2.112596
H  -2.180074 -0.444031 1.456358
H  2.190857 -0.419027 1.457748
H  0.007965 -0.970144 2.631503
H  -7.433453 1.141911 -1.360111
H  7.432606 1.273171 -1.231766
H  -4.825359 -1.132418 1.26553
H  4.820959 -1.304276 1.093404
H  -9.419295 0.186675 -0.064541
H  9.413176 0.215322 -0.010012
H  -8.951976 -1.390243 1.856226
H  8.941577 -1.561029 1.726678
