program: Gaussian 09
title: 000166994
version: EM64L-G09RevD.01
frameworkgroup: C1[X(C18H22NO3)]
method: RPBEPBE
basis: SDD
operation: Freq
keyword: #p
keyword: freq=noraman
keyword: PBEPBE/SDD
title: #p freq=noraman PBEPBE/SDD
converged: YES YES NO NO
title: Mulliken charges:
elementType: O O O N C C C C C C C C C C C C C C C C C C H H H H H H H H H H H H H H H H H H H H H H
charge: -0.188455 -0.411940 -0.386243 -0.100515 0.251889 -0.251344 -0.163606 -0.556695 -0.193334 -0.033045 -0.412491 -0.612196 0.386014 -0.224917 -0.123972 0.099437 -0.573380 -0.573509 -0.223484 -0.419768 0.137967 -0.351248 0.261017 0.271896 0.251941 0.284216 0.263916 0.302590 0.267168 0.271830 0.245128 0.231752 0.202580 0.261069 0.268476 0.274309 0.266445 0.261600 0.274394 0.251566 0.245927 0.237017 0.355613 0.374387
chargesum: 1.00000
title: Mulliken charges with hydrogens summed into heavy atoms:
elementType: O O O N C C C C C C C C C C C C C C C C C C
charge: -0.188455 -0.056327 -0.011856 -0.100515 0.251889 0.009673 0.108290 -0.020538 0.070582 -0.033045 0.157267 -0.095239 0.386014 0.006834 0.078608 0.099437 0.230474 0.228930 0.028081 -0.173841 0.137967 -0.114231
polarizability: 2.32335785e+02 4.31245096e+00 1.96380824e+02 -8.04438785e+00 1.31823508e+01 1.53712694e+02
1716.lowfreq: -16.0843 -8.2453 -0.0007 0.0001 0.0005 12.3638 35.3589 68.5090 94.9709
frequency: 34.9902 68.4722 94.9059 112.1181 146.1706 161.6488 185.1981 225.1575 230.2276 234.1508 248.9587 260.9684 278.2171 282.3030 319.2114 322.6140 335.2159 355.5372 362.1196 368.0452 404.7502 415.7246 432.1689 449.4245 457.3414 477.8179 487.6441 517.9619 538.1265 551.0262 568.9498 592.6222 606.3268 619.8586 656.9411 676.5517 689.6438 712.5587 741.9150 753.5459 773.8734 792.9364 815.6794 817.9842 866.0642 880.0214 903.9859 908.7142 921.1596 924.9555 940.3654 945.5301 957.6609 969.3712 1004.2986 1015.5170 1021.7921 1050.1602 1061.3795 1069.6411 1087.1762 1096.7979 1115.3560 1129.3934 1139.1975 1149.6827 1157.9914 1173.7369 1186.8434 1195.8486 1203.4845 1205.8962 1220.8725 1234.6836 1247.9956 1253.5089 1260.3409 1276.1592 1284.2340 1289.9092 1311.9119 1325.4601 1328.5738 1341.7520 1345.4315 1351.2849 1357.6445 1371.7698 1378.2415 1413.7145 1415.1057 1440.7350 1446.5435 1449.9909 1458.2689 1465.0745 1467.1825 1478.1113 1482.2754 1498.9246 1503.6727 1618.8525 1646.2367 1647.6544 2873.9895 2964.1427 2978.5095 2991.3802 3018.8626 3025.5443 3027.1364 3032.7720 3044.5677 3053.9903 3071.1396 3098.7083 3114.6799 3125.1168 3133.1283 3138.5127 3147.9504 3148.9571 3159.3088 3170.1401 3562.4184 3578.9346
redmass: 5.0253 5.2438 3.0609 3.7401 3.0792 1.2643 3.6989 1.4843 1.2233 3.2606 4.2953 2.5785 3.5622 4.0868 3.1069 3.2391 2.9075 2.9528 1.2354 2.3076 2.8991 3.3645 3.3837 4.0023 4.4686 3.7402 2.9451 3.7782 3.7304 3.4867 3.9273 4.6022 4.7757 2.4961 4.2332 3.0669 4.2007 4.8517 3.8104 3.5314 2.7145 1.5095 4.3236 4.0846 3.6296 2.7179 2.5707 1.4855 3.1393 1.8596 2.3987 2.2340 2.3412 2.6621 2.5928 3.0864 2.4038 3.5499 2.2893 1.8174 1.9057 1.9458 2.1734 1.4824 2.0805 1.4787 1.5561 1.3021 1.4528 1.5463 1.2361 1.7236 1.9435 1.7340 1.4727 1.4140 1.6829 1.7046 1.7490 1.4086 1.6913 1.5656 1.3215 1.5234 1.5139 1.3348 1.4399 1.2849 1.5046 5.8467 1.1784 1.1496 2.1528 1.2712 1.1005 1.1154 1.1119 1.0550 1.0540 3.0099 1.1173 8.6551 7.9012 7.8704 1.0803 1.0815 1.0696 1.0631 1.0857 1.0431 1.0513 1.0368 1.0876 1.0992 1.0884 1.1077 1.0865 1.0877 1.1051 1.1044 1.0962 1.1000 1.1035 1.1021 1.0668 1.0665
irintensity: 1.3909 1.9809 0.4214 2.0637 4.0593 2.3592 8.2148 91.8930 26.1933 16.6500 8.4384 15.6051 1.3977 7.2939 1.1818 6.1905 25.9646 7.1128 102.0168 4.2260 3.3628 0.8539 0.2075 1.3514 0.6657 0.7778 3.8752 2.9794 4.0617 1.8959 4.1537 16.0268 5.7783 13.1902 10.4217 3.1936 5.3967 6.1268 16.9530 54.0341 41.0962 21.4478 30.0888 10.8490 4.0100 24.5486 19.5745 6.1428 18.5304 16.1230 28.4655 7.1924 13.8025 6.3066 44.5912 58.2505 24.0877 52.6988 14.3923 8.8041 57.1382 33.5588 18.0624 25.2472 43.5114 3.8023 12.0765 10.7660 7.0538 18.4766 47.4461 20.8850 32.1565 1.3731 8.3880 7.7467 6.8061 51.8481 28.7324 12.4118 18.9684 8.8271 1.3666 5.8641 3.1157 4.9599 9.2968 4.1128 2.6304 8.2899 11.7802 13.0706 20.4204 4.6151 10.7846 58.8304 23.2062 54.4612 13.2633 73.6172 42.9267 20.3311 27.7007 17.2901 35.8150 28.0632 8.4520 20.5563 20.6309 3.1711 11.0296 11.3495 32.7562 7.9448 21.3397 5.5520 3.6767 8.4858 0.5222 7.1907 7.9417 8.3854 4.1067 4.4308 18.4976 79.2494
temp: 298.150 k
press: 1.00000 atm
elementType: 8 8 8 7 6 6 6 6 6 6 6 6 6 6 6 6 6 6 6 6 6 6 1 1 1 1 1 1 1 1 1 1 1 1 1 1 1 1 1 1 1 1 1 1
symmnumber: 1
zpe: 966173.7 jmol-1
zpe.correction: 0.367996 hartree
zpe.thermalcorrener: 0.386724 hartree
zpe.thermalcorrenthalpy: 0.387668 hartree
zpe.thermalcorrgfe: 0.323526 hartree
zpe.sumelectzpe: -977.616954 hartree
zpe.sumelectthermal: -977.598227 hartree
zpe.sumelectthermalent: -977.597282 hartree
zpe.sumelectthermalfe: -977.661424 hartree
dipole: -12.3473 0.2874 1.3990
dipole: 12.4296
quadrupole: -79.1955 -94.5579 -116.6857
quadrupole: 5.2747 11.9823 -0.0746
quadrupole: 17.6176 2.2551 -19.8727 5.2747 11.9823 -0.0746
hfenergy: -977.9849502 hartree
pointgroup: C01 [X(C18H22N1O3)]
dipole: -4.8557664 -0.2516146 -0.5216632 debye
polarizability: 232.7204533|-3.3232521|194.4799268|6.6976126|15.7802257|155.2289233 unknown
InChI: InChI=1S/C18H22NO3/c1-19(2)8-7-18-11-4-6-14(21)17(18)22-16-13(20)5-3-10(15(16)18)9-12(11)19/h3-6,11-12,14,17,20-21H,7-9H2,1-2H3
charge 1 multiplicity 1
44 atoms
O  2.154043 0.572295 1.169488
O  2.754211 2.948922 0.013712
O  3.920968 -1.700392 0.655258
N  -3.060049 -0.261338 0.334654
C  -0.228617 0.676554 0.601535
C  -1.137574 1.206045 -0.548267
C  -2.13919 0.060837 -0.918031
C  -1.099892 0.382385 1.856733
C  1.016711 1.549233 0.979233
C  0.445482 -0.586651 0.089383
C  -2.194305 -0.647715 1.558894
C  -1.418929 -1.197622 -1.477515
C  -0.102946 -1.535244 -0.785406
C  -0.281149 1.626809 -1.735939
C  1.337625 2.63255 -0.096579
C  1.780132 -0.606355 0.503205
C  -4.008235 -1.419705 0.028759
C  -3.937028 0.947075 0.663025
C  0.898973 2.25546 -1.506744
C  0.719792 -2.636816 -1.128101
C  2.610477 -1.705821 0.188604
C  2.037586 -2.730523 -0.616323
H  -1.707537 2.093282 -0.202385
H  -2.860771 0.422407 -1.676314
H  -1.523751 1.323205 2.258288
H  -0.463969 -0.041837 2.655826
H  0.927951 2.041513 1.961261
H  -1.738375 -1.621199 1.313683
H  -2.886966 -0.778671 2.408295
H  -1.188197 -0.944814 -2.532971
H  -2.100477 -2.063473 -1.548946
H  -0.626086 1.418587 -2.756199
H  0.723558 3.51845 0.203756
H  -4.740187 -1.498255 0.847726
H  -4.531572 -1.221997 -0.919797
H  -3.446482 -2.360128 -0.039316
H  -4.533025 1.207891 -0.225329
H  -4.606915 0.678531 1.494369
H  -3.320988 1.803089 0.960258
H  1.550392 2.562925 -2.333708
H  0.359772 -3.412486 -1.813006
H  2.655234 -3.595413 -0.889471
H  2.940439 3.815302 -0.430139
H  4.430263 -2.485891 0.333542
