program: Gaussian 09
title: 000166909
version: EM64L-G09RevD.01
frameworkgroup: C1[X(C12H21N3O8)]
method: RPBEPBE
basis: SDD
operation: Freq
keyword: #p
keyword: freq=noraman
keyword: PBEPBE/SDD
title: #p freq=noraman PBEPBE/SDD
converged: YES YES NO NO
title: Mulliken charges:
elementType: O O O O O O O O N N N C C C C C C C C C C C C H H H H H H H H H H H H H H H H H H H H H
charge: -0.416581 -0.419065 -0.415729 -0.417239 -0.228550 -0.223261 -0.229501 -0.229450 -0.283120 -0.108743 -0.111004 -0.372565 -0.368783 -0.370239 -0.364993 -0.435712 -0.440397 -0.432912 -0.440611 0.197983 0.194137 0.197210 0.195348 0.243699 0.181833 0.211982 0.215448 0.176864 0.256727 0.197025 0.232508 0.237543 0.266199 0.232329 0.292514 0.230308 0.268341 0.233343 0.292648 0.229872 0.382621 0.379826 0.382378 0.379768
chargesum: 0.00000
title: Mulliken charges with hydrogens summed into heavy atoms:
elementType: O O O O O O O O N N N C C C C C C C C C C C C
charge: -0.033960 -0.039239 -0.033351 -0.037471 -0.228550 -0.223261 -0.229501 -0.229450 -0.045578 -0.108743 -0.111004 0.052967 0.058648 0.063352 0.064541 0.062816 0.082425 0.068772 0.081908 0.197983 0.194137 0.197210 0.195348
polarizability: 2.07631698e+02 -3.29978893e+00 1.87365501e+02 -5.27518742e-01 1.51060790e-01 1.41445770e+02
1716.lowfreq: -4.6979 -0.0008 -0.0007 -0.0006 0.9119 5.1382 10.0545 10.6986 20.5717
frequency: 9.7503 10.6276 20.5435 29.2114 34.3244 35.8914 39.4488 46.8749 49.1421 53.7490 57.7896 59.9895 80.8675 121.8392 130.5637 154.1939 183.3531 191.6388 195.9507 210.3302 218.0090 269.6098 282.5583 296.1899 323.4576 324.7129 335.8822 346.2386 433.6845 444.8667 473.7028 485.1131 486.6807 496.7213 501.3641 506.5640 526.7370 593.1294 600.9898 618.7592 619.5470 631.8929 633.2529 647.9808 649.7762 702.6276 786.3636 798.2323 825.0028 829.0982 860.5100 861.7048 893.1436 897.3379 969.2024 970.9850 978.7365 979.5388 1013.3277 1020.7083 1025.1371 1041.1758 1047.2801 1048.6635 1060.1076 1085.8256 1114.6684 1143.3320 1147.3173 1153.7097 1157.7665 1207.3218 1225.9952 1241.9064 1245.1783 1245.2267 1258.5292 1259.7591 1266.6376 1271.6238 1285.9159 1287.7290 1296.2219 1306.5028 1321.3993 1346.7828 1378.1757 1381.2760 1382.9976 1388.4592 1391.1685 1400.4686 1433.1728 1433.6356 1444.1752 1445.8337 1457.8122 1467.9428 1472.4850 1483.5491 1492.8420 1674.6304 1675.7543 1679.4555 1682.3506 2831.2672 2835.1207 2856.8635 2858.2354 2863.5052 2872.2511 2915.5673 2931.9060 3009.3200 3049.3253 3050.6157 3052.1258 3054.8441 3057.9311 3059.1105 3079.6907 3411.6563 3515.4505 3515.4616 3521.1302 3521.3752
redmass: 7.3745 7.3659 7.5080 7.1604 11.1426 9.8018 5.4054 9.3205 8.9234 8.4796 4.2921 3.4512 3.6487 2.2942 2.6940 2.9394 2.6997 3.4431 3.8450 3.9374 4.1554 3.1288 5.0745 4.9737 3.4847 3.8076 3.8819 4.3144 3.2342 3.4425 2.3630 2.0134 2.0842 2.6468 2.6888 2.7280 3.8817 4.0100 4.0637 1.7576 1.7864 1.4980 1.5180 2.5881 2.7606 1.2717 1.2152 1.3442 4.0764 3.3765 4.1355 4.0438 4.1927 4.1665 2.5187 2.4882 2.2354 2.2379 2.8987 2.5257 2.9348 2.3657 2.3880 2.3765 2.1372 2.8707 1.9402 3.6345 1.6440 2.1486 1.7219 1.7671 1.2895 1.2783 1.3952 1.4077 1.4914 1.4708 1.3543 1.4328 1.7788 1.9559 1.2631 1.3878 1.6404 1.4477 1.4944 1.5855 1.5576 1.5627 1.5657 1.3942 1.0996 1.1011 1.1155 1.1158 1.2003 1.0881 1.0993 1.0914 1.0806 8.4609 8.4910 8.3449 8.4380 1.0711 1.0711 1.0719 1.0706 1.0711 1.0710 1.0689 1.0662 1.0928 1.0850 1.0866 1.0879 1.0889 1.0846 1.0859 1.0902 1.0735 1.0641 1.0641 1.0641 1.0641
irintensity: 0.5564 0.5957 0.1058 0.0921 1.5968 0.3768 0.4648 1.1735 0.4325 0.1600 1.6183 0.1279 0.3109 3.2145 2.7515 1.1980 0.4354 9.0671 5.3695 3.2536 2.3339 7.1987 1.4549 0.2648 6.3052 1.3195 8.5753 0.2427 0.4239 32.2001 30.6697 33.3636 33.7451 4.6923 48.4927 40.7369 32.8420 38.2255 7.3084 31.2175 81.1176 54.6669 273.1456 11.5937 97.9105 93.7974 1.7915 13.2569 14.8642 13.8252 0.0429 0.6400 7.6815 11.5777 117.3666 10.9402 14.6509 15.9234 182.9776 130.6268 582.2027 291.6570 198.9683 40.0622 20.4886 2.9762 0.4705 54.0406 13.2048 112.1589 14.3469 11.8944 2.1808 19.5087 9.7918 21.0912 18.4799 10.6593 9.2469 11.1766 22.1808 3.7203 1.0905 1.3077 13.2331 0.0550 14.1372 13.2977 15.9834 17.4417 18.0883 0.5508 44.7383 5.8894 22.9316 14.9861 23.1627 12.5228 6.0619 10.8924 6.4248 137.3195 272.3675 276.1918 189.3329 86.1118 77.3461 186.1094 36.1821 65.7248 113.9781 17.2136 117.4880 19.4725 5.8371 13.8637 31.1670 2.6788 6.6296 17.8226 20.4406 1.9817 31.2950 24.4437 31.4063 25.1399
temp: 298.150 k
press: 1.00000 atm
elementType: 8 8 8 8 8 8 8 8 7 7 7 6 6 6 6 6 6 6 6 6 6 6 6 1 1 1 1 1 1 1 1 1 1 1 1 1 1 1 1 1 1 1 1 1
symmnumber: 1
zpe: 903005.1 jmol-1
zpe.correction: 0.343936 hartree
zpe.thermalcorrener: 0.370334 hartree
zpe.thermalcorrenthalpy: 0.371278 hartree
zpe.thermalcorrgfe: 0.279056 hartree
zpe.sumelectzpe: -1234.070475 hartree
zpe.sumelectthermal: -1234.044078 hartree
zpe.sumelectthermalent: -1234.043134 hartree
zpe.sumelectthermalfe: -1234.135356 hartree
dipole: -0.0994 -0.7386 -2.5216
dipole: 2.6294
quadrupole: -127.0614 -121.1115 -131.5887
quadrupole: 13.4558 -1.2176 1.6919
quadrupole: -0.4742 5.4757 -5.0015 13.4558 -1.2176 1.6919
hfenergy: -1234.414412 hartree
pointgroup: C01 [X(C12H21N3O8)]
dipole: -0.0462594 -0.2634853 -0.9992909 debye
polarizability: 207.7124346|-2.9247782|187.2171137|-1.4081621|1.4512766|141.5134211 unknown
InChI: InChI=1S/C12H21N3O8/c16-9(17)5-14(6-10(18)19)3-1-13-2-4-15(7-11(20)21)8-12(22)23/h13,16,18,20,22H,1-8H2
charge 0 multiplicity 1
44 atoms
O  -5.095097 -3.102586 1.713795
O  -5.630127 2.737264 -1.186504
O  4.78815 3.212785 1.672989
O  5.987708 -2.483246 -1.241023
O  -5.711726 -0.864962 1.794285
O  -3.539475 2.561723 -0.187218
O  5.631494 1.050012 1.743912
O  3.836231 -2.589941 -0.37208
N  0.009531 -0.272565 -0.915785
N  -3.737877 -0.321564 -0.316839
N  3.72251 0.309111 -0.361193
C  -2.461485 -0.245743 -1.069211
C  2.450934 0.096735 -1.09735
C  -1.240153 -0.219761 -0.127255
C  1.250641 -0.056406 -0.139153
C  -4.118635 -1.685358 0.052014
C  -4.829103 0.515553 -0.818002
C  3.951171 1.705285 0.014106
C  4.89894 -0.385687 -0.886843
C  -5.045415 -1.775288 1.26086
C  -4.545135 2.006161 -0.670294
C  4.871592 1.888364 1.217207
C  4.794105 -1.902414 -0.779062
H  -2.444189 0.682518 -1.663044
H  -2.364561 -1.0926 -1.794533
H  2.544059 -0.834238 -1.684687
H  2.236379 0.918365 -1.819132
H  -1.320516 -1.044498 0.625334
H  -1.27036 0.729445 0.435984
H  1.116127 0.870448 0.452664
H  1.487901 -0.873959 0.578732
H  0.06788 -1.144507 -1.463049
H  -3.208813 -2.258298 0.301783
H  -4.618768 -2.258977 -0.772849
H  -5.740772 0.317694 -0.226495
H  -5.093118 0.335921 -1.890403
H  2.985787 2.174305 0.271243
H  4.378433 2.33482 -0.810476
H  5.786366 -0.096901 -0.296477
H  5.132522 -0.150794 -1.956662
H  -5.725862 -3.166332 2.481527
H  -5.451287 3.709462 -1.070713
H  5.413482 3.339425 2.437327
H  5.921933 -3.472972 -1.158533
