program: Gaussian 09
title: 000166872
version: EM64L-G09RevD.01
frameworkgroup: C1[X(C13H14O4)]
method: RPBEPBE
basis: SDD
operation: Freq
keyword: #pfreq=noraman
keyword: PBEPBE/SDD
title: #p freq=noraman PBEPBE/SDD
converged: YES YES NO NO
title: Mulliken charges:
elementType: O O O O C C C C C C C C C C C C C H H H H H H H H H H H H H H
charge: -0.294590 -0.288698 -0.197070 -0.195547 0.551428 -0.626895 -0.507789 0.314011 -0.459667 0.266848 -0.331198 -0.026037 0.243894 0.244107 -0.585888 -0.743473 -0.743802 0.217773 0.229082 0.265381 0.237031 0.248619 0.235444 0.217800 0.220200 0.254950 0.246889 0.252796 0.254264 0.247096 0.253043
chargesum: 0.00000
title: Mulliken charges with hydrogens summed into heavy atoms:
elementType: O O O O C C C C C C C C C C C C C
charge: -0.294590 -0.288698 -0.197070 -0.195547 0.551428 -0.180040 -0.242408 0.314011 -0.222636 0.266848 -0.082579 0.209407 0.243894 0.244107 -0.147887 0.011162 0.010601
polarizability: 1.98448534e+02 -1.14739008e+00 1.48603086e+02 -9.33180652e+00 1.37023655e+01 1.13945184e+02
1716.lowfreq: -7.4881 0.0005 0.0006 0.0007 2.2757 5.3480 11.9889 28.6618 30.7156
frequency: 8.4659 28.5871 30.6989 34.7174 47.2823 65.1142 68.6721 74.0357 86.8744 93.2709 135.9360 195.9641 228.4854 264.6718 282.2963 331.1030 339.3229 370.8340 389.6958 454.0686 477.8706 494.4409 528.5146 550.9203 557.8874 569.5817 602.1420 637.8592 675.2066 701.1990 735.7038 764.1783 813.8713 834.7382 854.4525 889.3377 923.5270 935.6406 950.9030 954.8921 958.4912 985.5682 990.2408 1015.7858 1037.6155 1040.6861 1078.3891 1115.3955 1137.0326 1156.3245 1173.0245 1190.9534 1211.0006 1240.9026 1256.6286 1287.3902 1302.1337 1380.9295 1382.7163 1384.5642 1413.0314 1426.4802 1450.6681 1451.8867 1452.3847 1453.7104 1455.0760 1486.3875 1591.6896 1617.0217 1656.2916 1683.7844 1691.6669 2969.9105 3009.3546 3009.5932 3020.9057 3084.4191 3096.7034 3096.9044 3098.0914 3134.7735 3145.3356 3145.4217 3153.0250 3167.3802 3196.7374
redmass: 1.2424 4.1031 3.8594 7.1845 1.6599 3.1459 2.9944 1.8442 4.1840 3.4035 3.3292 4.5842 4.5644 3.7650 5.9506 3.9367 3.7346 4.0319 2.4703 3.3513 4.0069 2.8515 4.1036 3.1583 3.4658 4.1096 3.0047 3.1589 4.5798 5.0926 3.1829 3.9251 4.3839 1.7271 4.4134 1.6504 1.4848 2.1573 1.4517 2.3352 1.5378 2.1809 2.0143 1.1553 1.6479 1.6494 4.2376 1.7607 1.5091 2.5170 3.4699 1.8361 1.3304 3.2288 1.3559 1.3122 1.6739 5.9732 1.2533 1.2535 2.9695 1.2361 1.0484 1.0476 1.0538 1.0587 1.1162 3.0267 8.1353 7.2059 4.6851 10.2185 10.4686 1.0593 1.0368 1.0367 1.1000 1.0624 1.0971 1.0971 1.0917 1.0893 1.1014 1.1014 1.0921 1.0960 1.1143
irintensity: 1.4686 0.6700 0.0843 0.5055 2.3769 1.4504 3.7054 1.0668 2.6292 2.7331 1.3774 0.5944 1.4783 2.3100 3.7989 1.4589 0.5040 0.5235 2.4976 9.3210 6.3199 5.9123 13.0014 2.9908 1.7780 5.8692 5.6408 14.6070 2.8347 1.7933 9.9747 6.4252 70.6651 19.7421 113.6862 1.2734 18.8757 13.0956 59.3992 25.6553 9.0576 65.5227 126.8525 17.7178 12.6003 2.3236 154.6181 1.0730 15.9402 229.6946 548.0723 7.6787 1.9785 45.9685 1.0719 3.4914 8.2164 2.4820 38.7342 86.5620 11.2319 7.5279 20.3060 19.5671 43.6224 3.2634 28.8314 90.1389 5.0641 15.8768 15.9919 2.0728 312.0689 25.6824 1.5104 1.2758 12.6418 14.9180 7.4935 4.3426 8.1444 11.8520 10.8482 8.9237 1.3400 6.3761 25.7560
temp: 298.150 k
press: 1.00000 atm
elementType: 8 8 8 8 6 6 6 6 6 6 6 6 6 6 6 6 6 1 1 1 1 1 1 1 1 1 1 1 1 1 1
symmnumber: 1
zpe: 624853.6 jmol-1
zpe.correction: 0.237994 hartree
zpe.thermalcorrener: 0.256341 hartree
zpe.thermalcorrenthalpy: 0.257285 hartree
zpe.thermalcorrgfe: 0.186418 hartree
zpe.sumelectzpe: -803.410361 hartree
zpe.sumelectthermal: -803.392014 hartree
zpe.sumelectthermalent: -803.391070 hartree
zpe.sumelectthermalfe: -803.461937 hartree
dipole: 0.2120 0.1121 0.0459
dipole: 0.2441
quadrupole: -80.4245 -87.5681 -110.5435
quadrupole: 3.2066 -2.7255 9.4059
quadrupole: 12.4208 5.2773 -17.6981 3.2066 -2.7255 9.4059
hfenergy: -803.6483548 hartree
pointgroup: C01 [X(C13H14O4)]
dipole: 0.0807445 -0.0494307 -0.0162303 debye
polarizability: 198.0089187|-2.1536967|148.8701408|11.6791466|12.7616343|114.1177445 unknown
InChI: InChI=1S/C13H14O4/c1-4-5-11-6-7-12(16-9(2)14)13(8-11)17-10(3)15/h4,6-8H,1,5H2,2-3H3
charge 0 multiplicity 1
31 atoms
O  0.757794 -1.360064 -0.543398
O  2.132339 0.844876 0.664072
O  1.006136 -2.108307 1.67159
O  2.663537 1.051994 -1.617552
C  -2.078147 1.021037 0.013302
C  -3.585562 1.096108 -0.236677
C  -1.347796 -0.142911 -0.332878
C  0.040962 -0.195773 -0.133209
C  -1.378761 2.119627 0.572474
C  0.730856 0.912162 0.406888
C  0.018925 2.069466 0.765577
C  -4.33604 -0.168776 0.139338
C  1.223469 -2.263976 0.459078
C  3.03406 0.898623 -0.442754
C  -5.130058 -0.878223 -0.701227
C  1.971687 -3.392959 -0.210729
C  4.447763 0.761619 0.072793
H  -3.995035 1.950104 0.33958
H  -3.773967 1.320503 -1.305645
H  -1.858456 -1.014634 -0.755291
H  -1.928753 3.023778 0.857409
H  0.564862 2.915046 1.194926
H  -4.208577 -0.507349 1.178817
H  -5.660294 -1.777318 -0.368159
H  -5.275309 -0.576743 -1.746528
H  1.291768 -3.946801 -0.881322
H  2.377406 -4.073962 0.550778
H  2.787013 -2.991901 -0.836769
H  4.683652 1.602279 0.748393
H  5.152517 0.755354 -0.770748
H  4.550708 -0.165378 0.66237
