program: Gaussian 09
title: 000166842
version: EM64L-G09RevD.01
frameworkgroup: C1[X(C13H21NO)]
method: RPBEPBE
basis: SDD
operation: Freq
keyword: #p
keyword: freq=noraman
keyword: PBEPBE/SDD
title: #p freq=noraman PBEPBE/SDD
converged: YES YES NO NO
title: Mulliken charges:
elementType: O N C C C C C C C C C C C C C H H H H H H H H H H H H H H H H H H H H H
charge: -0.468806 -0.413348 -0.124507 -0.208438 -0.027363 0.472807 -0.733599 -0.663388 -0.715105 -0.435959 -0.389009 -0.398452 -0.382752 0.437054 -0.809410 0.240468 0.184897 0.268919 0.196338 0.255651 0.202674 0.221705 0.207954 0.218874 0.225235 0.210566 0.221125 0.224559 0.226213 0.266756 0.358980 0.225637 0.224187 0.224823 0.222969 0.231744
chargesum: 0.00000
title: Mulliken charges with hydrogens summed into heavy atoms:
elementType: O N C C C C C C C C C C C C C
charge: -0.109826 -0.144429 0.115961 -0.023541 0.168974 0.472807 -0.053569 -0.011326 -0.058855 -0.209745 -0.122252 -0.172815 -0.158565 0.437054 -0.129874
polarizability: 2.04484722e+02 1.03322108e+00 1.46650459e+02 1.20823185e+01 3.61225237e+00 1.06063630e+02
1716.lowfreq: -20.5279 -15.0586 -7.3967 -2.0217 -0.0005 -0.0004 0.0005 20.1893 29.3998
frequency: -15.2046 19.9722 28.4830 45.1586 56.9989 89.5819 151.1066 184.8710 192.6193 202.4320 235.2958 240.0051 244.6423 292.0116 328.7188 340.6894 369.3071 384.3289 406.3916 409.1242 444.8609 475.7396 523.4238 544.4183 573.7440 637.5626 680.9070 727.1531 758.6885 809.4978 813.8461 833.8270 845.1439 857.5407 877.2446 901.2192 916.3092 951.9530 954.4770 979.0361 982.8846 985.1282 1010.8004 1020.6926 1046.4583 1064.5181 1088.4359 1114.4649 1122.1559 1144.0488 1163.4673 1180.1501 1184.8696 1209.5142 1220.5474 1236.1205 1281.7601 1293.9752 1304.8316 1318.1202 1332.6332 1347.0782 1378.9133 1380.2215 1387.2765 1394.4929 1395.9777 1401.3186 1408.1648 1441.8488 1464.6713 1466.8840 1466.9952 1472.1328 1473.2937 1475.9810 1482.7930 1487.1601 1508.5620 1585.3736 1625.4153 2891.9104 2897.3203 2970.9117 2972.0344 2975.1938 2982.1948 3021.2483 3052.8519 3065.3672 3067.7084 3079.7672 3081.1731 3082.1389 3084.3542 3090.2517 3104.9150 3115.6779 3130.7264 3132.7989 3157.3794 3413.6916
redmass: 1.0164 3.4292 2.8091 3.2170 4.0953 3.5880 3.4181 4.2265 2.9767 1.0597 2.1401 1.2881 1.0988 4.0858 2.8193 2.9671 2.6995 2.9927 2.7187 2.8952 2.3583 2.2603 3.7694 2.8633 4.3950 6.9190 1.7914 3.1742 3.3465 2.7064 1.4275 1.3866 2.4565 1.2843 1.6671 1.6799 1.1961 1.4247 1.3349 1.8984 1.4005 1.6049 3.4557 3.9407 1.5560 2.2465 2.4567 1.7578 1.4617 2.1727 2.0151 1.6586 1.3228 2.5612 2.6977 1.3436 1.2538 1.2812 1.2354 1.2732 1.3985 1.3309 2.8555 1.3706 1.2391 1.2241 1.2268 2.0442 1.8812 1.2102 1.0504 1.0795 1.0505 1.0784 1.0678 1.0544 1.0529 1.0590 2.7919 6.1413 6.4640 1.0829 1.0831 1.0373 1.0387 1.0363 1.0358 1.0848 1.0948 1.0979 1.0993 1.0995 1.0988 1.0997 1.0996 1.0991 1.0867 1.0893 1.0938 1.0649 1.0944 1.0740
irintensity: 0.4399 0.1531 0.2843 0.3387 2.3654 0.7028 2.3566 3.4730 0.6551 0.0941 2.5180 0.2652 1.1907 1.4960 2.5482 8.6911 0.5662 1.6662 3.7093 0.9750 2.9459 10.6045 3.0075 9.2075 6.0632 0.3583 23.8404 0.3344 5.5575 24.8257 7.2648 136.1615 34.8646 8.0565 15.6872 7.3534 3.7486 2.2025 2.4952 5.4292 2.8700 2.8909 25.2428 36.5914 14.7769 13.2840 12.7841 12.3766 5.5635 108.7630 18.7890 8.7246 15.5573 15.4632 0.4096 8.0039 17.6907 4.4355 14.5637 10.7120 31.9838 9.0046 21.9680 15.2060 15.6265 29.0349 9.7649 51.9228 28.1456 34.1365 1.4203 5.0949 4.8123 13.9262 14.0307 6.8963 3.8224 22.5815 27.7235 0.1678 0.8760 69.2674 56.7699 24.4678 44.1532 35.8732 15.0561 9.8151 25.7848 36.1049 32.4971 25.1361 26.4034 18.9908 30.0420 68.5248 15.8634 27.8948 58.0945 239.8426 4.9783 0.2843
temp: 298.150 k
press: 1.00000 atm
elementType: 8 7 6 6 6 6 6 6 6 6 6 6 6 6 6 1 1 1 1 1 1 1 1 1 1 1 1 1 1 1 1 1 1 1 1 1
symmnumber: 1
zpe: 819729.5 jmol-1
zpe.correction: 0.312218 hartree
zpe.thermalcorrener: 0.328328 hartree
zpe.thermalcorrenthalpy: 0.329272 hartree
zpe.thermalcorrgfe: 0.267312 hartree
zpe.sumelectzpe: -636.782462 hartree
zpe.sumelectthermal: -636.766353 hartree
zpe.sumelectthermalent: -636.765408 hartree
zpe.sumelectthermalfe: -636.827369 hartree
dipole: 2.0478 1.7551 -2.8095
dipole: 3.8945
quadrupole: -77.3650 -87.2813 -100.1605
quadrupole: 1.7570 1.1342 4.2326
quadrupole: 10.9039 0.9876 -11.8915 1.7570 1.1342 4.2326
hfenergy: -637.0946806 hartree
pointgroup: C01 [X(C13H21N1O1)]
dipole: -0.8184053 0.4661375 -1.2085643 debye
polarizability: 203.923544|12.327107|124.1585995|-6.8575197|20.2583213|129.1166666 unknown
InChI: InChI=1S/C13H21NO/c1-9(2)14-11(4)13(15)12-7-5-10(3)6-8-12/h5-9,11,13-15H,1-4H3
charge 0 multiplicity 1
36 atoms
O  -0.934888 -1.034194 1.554664
N  -2.796409 -0.47682 -0.200315
C  -1.413146 -0.190397 -0.690322
C  -0.423866 -1.052733 0.188734
C  -3.765216 0.663941 -0.186209
C  0.999638 -0.519429 0.153157
C  -1.236629 -0.42869 -2.202102
C  -3.478685 1.60033 1.007785
C  -5.196184 0.094284 -0.112337
C  1.938971 -1.00442 -0.788842
C  1.406723 0.499169 1.049528
C  3.245404 -0.469784 -0.849282
C  2.71343 1.028161 0.989536
C  3.654391 0.561562 0.034009
C  5.052041 1.15338 -0.042994
H  -1.20247 0.870378 -0.457731
H  -0.436323 -2.093028 -0.215021
H  -3.195867 -1.291016 -0.691161
H  -3.674533 1.257965 -1.127108
H  -0.208702 -0.185609 -2.524134
H  -1.430507 -1.48879 -2.459478
H  -1.935112 0.199802 -2.784803
H  -4.1563 2.473552 0.983163
H  -3.630371 1.060868 1.960251
H  -2.440362 1.976446 0.994751
H  -5.430337 -0.52952 -0.996425
H  -5.937883 0.910891 -0.069332
H  -5.31373 -0.527835 0.794226
H  1.655442 -1.817943 -1.469387
H  0.697553 0.833275 1.813884
H  -1.934537 -0.934755 1.3984
H  3.959773 -0.865708 -1.582043
H  3.014557 1.807637 1.701106
H  5.406919 1.482273 0.949966
H  5.779751 0.424072 -0.440933
H  5.075862 2.038385 -0.708898
