program: Gaussian 09
title: 000166845
version: EM64L-G09RevD.01
frameworkgroup: C1[X(C8H15NO4)]
method: RPBEPBE
basis: SDD
operation: Freq
keyword: #p
keyword: freq=noraman
keyword: PBEPBE/SDD
title: #p freq=noraman PBEPBE/SDD
converged: YES YES NO NO
title: Mulliken charges:
elementType: O O O O N C C C C C C C C H H H H H H H H H H H H H H H
charge: -0.262810 -0.268316 -0.243587 -0.240239 -0.555250 -0.255770 -0.494818 0.238573 0.267793 -0.224041 -0.226688 -0.674077 -0.675101 0.275523 0.241724 0.265832 0.287746 0.282046 0.229431 0.231167 0.225460 0.231653 0.212687 0.234721 0.226920 0.211607 0.233389 0.224427
chargesum: 0.00000
title: Mulliken charges with hydrogens summed into heavy atoms:
elementType: O O O O N C C C C C C C C
charge: -0.262810 -0.268316 -0.243587 -0.240239 0.014541 0.019753 0.012737 0.238573 0.267793 0.236557 0.230425 0.000251 -0.005679
polarizability: 1.22859791e+02 1.13706692e+01 1.02925460e+02 2.96915997e+00 -2.37593056e+00 9.46179802e+01
1716.lowfreq: -22.5759 -3.1568 -0.0007 -0.0004 0.0005 5.3252 9.2229 21.8098 46.9788
frequency: -19.7639 21.0813 46.9393 53.9828 58.0906 96.1136 103.8299 141.0122 166.2326 190.3691 201.6693 230.6470 253.2921 284.4619 292.6083 313.8677 342.5700 361.6321 408.3919 447.3682 601.1660 643.0207 686.6124 694.6802 732.3085 793.2197 799.7440 800.3639 808.5359 846.4690 918.2038 958.2419 994.1651 1019.3550 1027.7026 1101.7007 1110.8027 1113.6927 1120.3137 1130.1675 1134.0032 1134.6559 1191.0990 1208.6835 1246.8555 1249.3669 1291.2522 1318.9497 1353.2175 1356.0449 1372.0118 1398.0291 1401.8136 1452.6865 1460.7424 1462.6424 1471.3105 1474.6427 1485.0163 1486.0049 1628.3997 1638.9001 1651.5413 2993.8522 2995.8800 3008.1220 3011.7769 3033.5409 3059.4277 3065.1527 3070.2390 3090.6806 3092.0200 3104.4760 3107.4391 3109.4106 3447.5255 3572.9824
redmass: 2.8745 3.7089 4.1628 4.2176 2.6502 2.7731 3.5487 3.2271 2.4934 2.5539 1.3643 1.2963 1.5648 4.5425 2.7893 2.9711 3.5061 3.4803 2.6944 4.3237 4.3773 2.1782 2.1590 5.5477 5.7970 1.3014 1.1097 2.3540 3.7080 5.1195 4.7363 2.0089 3.0410 2.3369 2.4907 1.6531 2.4344 2.0811 2.6315 3.0164 1.6610 1.4833 1.6098 1.9458 1.1373 1.1375 1.4245 1.3825 1.3229 1.4349 1.3723 1.2669 1.2657 1.0988 1.0412 1.0408 1.0584 1.0623 1.0712 1.0684 9.3377 9.5728 1.1070 1.0357 1.0359 1.0581 1.0582 1.0591 1.0853 1.1062 1.1063 1.0989 1.0987 1.1023 1.1025 1.1047 1.0455 1.0966
irintensity: 0.1916 0.9883 0.7481 1.5184 0.6102 2.6502 1.2452 0.7973 2.3366 0.5993 49.0482 0.5823 0.6367 4.2985 33.3235 31.6883 9.4131 4.9867 3.9562 6.1430 5.8523 132.3778 186.2247 0.2251 5.6184 8.5734 2.2044 3.1436 5.4538 6.1881 22.3812 12.3460 24.7759 35.5398 78.4551 114.3802 42.1175 17.6797 73.3566 141.7633 45.7219 11.4975 56.1158 133.9236 0.6088 0.2062 16.7103 62.1329 1.1784 4.2567 3.3088 20.1263 21.8381 18.8268 19.1059 2.2254 1.1665 3.3185 23.7657 5.5169 171.6778 197.9533 35.5829 19.9349 20.4121 16.9181 17.1597 5.0431 5.8349 9.6706 5.4831 34.3910 31.7880 62.1144 33.0141 6.4720 2.4075 6.2169
temp: 298.150 k
press: 1.00000 atm
elementType: 8 8 8 8 7 6 6 6 6 6 6 6 6 1 1 1 1 1 1 1 1 1 1 1 1 1 1 1
symmnumber: 1
zpe: 601392.8 jmol-1
zpe.correction: 0.229058 hartree
zpe.thermalcorrener: 0.244247 hartree
zpe.thermalcorrenthalpy: 0.245191 hartree
zpe.thermalcorrgfe: 0.185082 hartree
zpe.sumelectzpe: -668.452915 hartree
zpe.sumelectthermal: -668.437727 hartree
zpe.sumelectthermalent: -668.436783 hartree
zpe.sumelectthermalfe: -668.496891 hartree
dipole: 1.4292 2.3143 -0.4230
dipole: 2.7527
quadrupole: -67.4170 -75.5750 -85.8979
quadrupole: 1.5448 -5.6319 6.8676
quadrupole: 8.8796 0.7216 -9.6013 1.5448 -5.6319 6.8676
hfenergy: -668.6819737 hartree
pointgroup: C01 [X(C8H15N1O4)]
dipole: 0.4950579 -0.9494557 0.1623528 debye
polarizability: 121.5396816|-12.3908547|104.6040113|-2.289333|-2.4437938|94.2595372 unknown
InChI: InChI=1S/C8H15NO4/c1-3-12-7(10)5-6(9)8(11)13-4-2/h6H,3-5,9H2,1-2H3
charge 0 multiplicity 1
28 atoms
O  -0.701548 -1.268613 -0.605529
O  1.44209 0.97389 0.564158
O  -2.119161 -1.013718 1.228386
O  0.966061 1.733628 -1.588073
N  -3.197785 1.355498 -0.036044
C  -1.866956 0.851041 -0.390291
C  -0.773099 1.829044 0.156739
C  -1.604242 -0.560943 0.178509
C  0.604149 1.529952 -0.406259
C  -0.295589 -2.619974 -0.098273
C  2.812688 0.59327 0.10176
C  0.752603 -3.157608 -1.066201
C  3.493141 -0.109676 1.27189
H  -1.766286 0.815726 -1.488585
H  -0.756565 1.79835 1.259224
H  -1.080873 2.835016 -0.173914
H  -3.430544 1.192893 0.951205
H  -3.943565 1.022934 -0.655141
H  0.091342 -2.498182 0.929484
H  -1.199132 -3.254521 -0.054447
H  2.710023 -0.055006 -0.7876
H  3.341256 1.513823 -0.205696
H  1.082899 -4.161075 -0.740993
H  0.342571 -3.23997 -2.087031
H  1.63494 -2.495241 -1.10031
H  4.517732 -0.409843 0.985699
H  3.558686 0.556691 2.148805
H  2.934465 -1.015087 1.566329
