program: Gaussian 09
title: 000166793
version: EM64L-G09RevD.01
frameworkgroup: C1[X(C8H10NO4P)]
method: RPBEPBE
basis: SDD
operation: Freq
keyword: #p
keyword: freq=noraman
keyword: PBEPBE/SDD
title: #p freq=noraman PBEPBE/SDD
converged: YES YES NO NO
title: Mulliken charges:
elementType: P O O O O N C C C C C C C C H H H H H H H H H H
charge: 1.149364 -0.536051 -0.627308 -0.215614 -0.219027 0.021097 -0.880032 -0.885925 0.364135 -0.319943 -0.348238 0.379001 -0.340326 -0.332704 0.293703 0.262613 0.263581 0.274205 0.287171 0.257948 0.315767 0.261059 0.287329 0.288194
chargesum: 0.00000
title: Mulliken charges with hydrogens summed into heavy atoms:
elementType: P O O O O N C C C C C C C C
charge: 1.149364 -0.536051 -0.627308 -0.215614 -0.219027 0.021097 -0.060135 -0.066601 0.364135 -0.004176 -0.087178 0.379001 -0.052998 -0.044510
polarizability: 2.15346963e+02 -5.07994324e+00 1.30541371e+02 -4.77638406e+00 -2.91130663e+00 7.83867172e+01
1716.lowfreq: -10.0007 -8.3971 -0.0018 -0.0004 0.0015 0.8915 23.8702 28.8574 72.2597
frequency: 23.6233 28.6802 72.2541 91.5270 101.5986 105.0896 148.2595 178.3452 194.9309 209.7345 240.0596 284.2140 291.8866 314.7559 339.4775 416.5952 431.6679 491.0147 503.2018 549.6621 620.0137 625.9743 663.1619 667.2699 719.3358 734.5864 775.0485 834.3894 838.2899 870.7931 903.5340 912.4231 930.8153 979.0156 983.2548 996.4276 998.1314 1059.8550 1094.7321 1108.3164 1170.4854 1217.7908 1224.9777 1294.0638 1329.1923 1344.5160 1354.8123 1394.6647 1425.4973 1430.7146 1434.8839 1436.8898 1448.1853 1473.7865 1586.5915 1603.3349 3013.6969 3020.3601 3131.8994 3139.5276 3140.9443 3147.4099 3156.8043 3167.9059 3183.3377 3189.0096
redmass: 4.1839 5.4309 6.9380 5.8496 1.4035 2.3368 1.0638 3.5864 7.5644 4.0974 3.3876 5.5757 6.1033 5.9265 7.0187 3.0538 8.0996 3.7065 6.5077 6.8615 6.0706 6.3523 8.5504 4.9063 3.8802 4.9048 9.8607 5.1596 1.3614 1.5600 1.2470 1.4545 1.8827 1.4204 1.3299 1.3542 2.8538 3.4417 3.1692 1.2742 1.4292 3.5799 6.2264 1.2882 1.1714 1.1667 7.6232 9.7013 1.0623 3.7733 1.0527 1.0470 1.0442 2.3810 7.8894 6.4592 1.0317 1.0318 1.1014 1.1022 1.1021 1.1021 1.0923 1.0890 1.0950 1.0972
irintensity: 3.0026 1.4564 0.0298 3.7822 0.7749 1.8199 0.4332 4.5469 2.7891 2.0025 0.6207 3.5162 9.9979 39.6326 22.9243 0.0397 35.8712 18.8246 5.1915 7.8465 3.8179 20.1601 127.5070 19.7996 32.7048 6.3231 8.8116 181.5330 21.7334 73.4011 19.8308 64.3965 4.9537 226.1434 0.9202 0.4621 0.6681 106.2838 21.2449 23.6636 245.1915 382.1461 250.6018 0.4025 28.7384 18.8412 89.4054 35.7181 7.5632 18.8674 4.5255 8.4125 25.8939 119.9355 42.0340 213.5757 1.2556 1.4118 1.8042 1.9913 2.9792 2.4299 4.4675 1.6059 0.6924 3.1540
temp: 298.150 k
press: 1.00000 atm
elementType: 15 8 8 8 8 7 6 6 6 6 6 6 6 6 1 1 1 1 1 1 1 1 1 1
symmnumber: 1
zpe: 453344.2 jmol-1
zpe.correction: 0.172670 hartree
zpe.thermalcorrener: 0.187554 hartree
zpe.thermalcorrenthalpy: 0.188498 hartree
zpe.thermalcorrgfe: 0.128858 hartree
zpe.sumelectzpe: -1006.596125 hartree
zpe.sumelectthermal: -1006.581241 hartree
zpe.sumelectthermalent: -1006.580297 hartree
zpe.sumelectthermalfe: -1006.639937 hartree
dipole: 8.2880 -3.5707 1.6514
dipole: 9.1742
quadrupole: -101.3943 -93.0716 -86.2561
quadrupole: -6.4689 5.7099 1.7099
quadrupole: -7.8203 0.5024 7.3179 -6.4689 5.7099 1.7099
hfenergy: -1006.7687948 hartree
pointgroup: C01 [X(C8H10N1O4P1)]
dipole: 3.2377826 -1.049392 1.201459 debye
dipolederiv: 2.6029213 0.0916985 0.0230396 0.6909702 1.3038363 0.1215526 0.0292189 0.1056685 1.4390607 -2.9014691 -0.1779535 -0.1356464 -0.1885545 -0.4899272 -0.0272609 0.0527898 -0.0197112 -0.4377344 -0.8616833 -0.0214705 0.0131315 -0.1364894 -0.6553433 0.0047402 0.0289499 0.0155683 -0.6698453 -0.7410611 0.1859567 -0.073507 0.3470692 -0.6796607 0.1723622 -0.1182698 0.1610683 -0.2984655 -0.9134948 -0.1838038 0.063004 -0.2955894 -0.5649097 0.1179472 0.1228861 0.1262343 -0.2845368 2.1469282 -0.0848416 0.043187 -0.1700744 0.9865231 -0.3001476 0.0270989 -0.2966436 0.3037266 -0.3595304 0.0773279 0.0086609 0.1159055 -0.2476116 -0.057726 -0.025342 -0.0494643 -0.2682294 -0.4213478 0.0455825 0.0062332 -0.0681272 -0.1825128 -0.0306057 -0.0484298 -0.0637878 -0.4016531 2.1923879 0.1158354 0.1141836 -0.5399455 0.1361085 -0.0950629 0.0643978 -0.0469518 0.1220496 -0.5558472 0.0706259 -0.0635353 0.5042956 -0.1347284 0.0132877 -0.1906104 -0.0252163 -0.1602382 -0.7303702 -0.0990019 -0.0116116 -0.3067963 0.0343095 -0.0771632 0.0685408 -0.0611269 -0.1396375 -1.0205037 0.0741277 -0.0498957 0.1412738 -0.0612056 0.0391246 -0.0314156 0.0337654 0.0141701 0.4468847 -0.0520982 0.024331 0.1755628 0.0126306 -0.0417029 -0.0746147 -0.0384355 -0.0718585 0.3616348 -0.007263 0.0065133 -0.3221311 0.0208739 -0.0525095 0.1288022 -0.0381438 -0.0733302 0.1401185 0.0159154 0.0032402 0.0082964 0.0957615 -0.050512 -0.0350121 -0.0314498 -0.021004 -0.0581343 -0.0503012 -0.0198099 -0.0376261 0.0651938 -0.0202964 -0.0129381 -0.0158531 0.1240258 0.1053732 0.0122242 0.0213119 0.0246114 -0.017449 0.0765137 0.0252012 0.074584 0.0593665 0.0060369 -0.0788724 -0.0301509 -0.0989703 0.0736913 -0.0127814 -0.098374 -0.0201111 0.0722971 0.0343503 0.0614226 0.0403518 0.0926589 0.0825473 -0.0107154 0.0897365 -0.0268609 0.070782 0.1287944 0.0061549 -0.0104117 0.0221699 -0.0262849 0.0676217 -0.0036777 0.0593212 0.0153173 0.1433144 -0.0406209 0.0385248 -0.0165116 0.0894842 0.0307559 0.0250055 0.0301508 0.1588908 0.0729315 0.0647556 -0.019605 0.0623003 0.0116603 0.0586764 -0.0282101 0.0577243 0.138576 0.104399 0.0411977 -0.0159168 0.0127506 0.0637274 0.0402211 -0.0084905 0.0385919 0.1513737 0.077367 -0.0665979 0.0243774 -0.0170486 0.0832855 0.0336806 0.0127573 0.0310791 0.1568967 unknown
polarizability: 215.5671518|-2.6598398|123.9727736|4.0116823|-17.452913|84.7351257 unknown
InChI: InChI=1S/C8H10NO4P/c1-14(2,12)13-8-5-3-7(4-6-8)9(10)11/h3-6H,1-2H3
charge 0 multiplicity 1
24 atoms
P  3.297181 0.432222 0.132577
O  1.957064 -0.764492 0.073461
O  3.103844 1.749916 -0.755733
O  -4.055122 1.333623 -0.578635
O  -4.402658 -0.778538 0.213692
N  -3.626575 0.186996 -0.160866
C  4.632532 -0.738743 -0.40799
C  3.416176 0.74476 1.968219
C  0.59343 -0.449715 0.003467
C  0.094245 0.795709 -0.467934
C  -0.291173 -1.484733 0.406136
C  -2.168398 -0.033694 -0.106327
C  -1.296619 1.000444 -0.515161
C  -1.678475 -1.280232 0.349765
H  4.470699 -0.973906 -1.470957
H  5.615117 -0.255706 -0.285004
H  4.582618 -1.664103 0.185643
H  4.292254 1.381788 2.172273
H  2.505165 1.272351 2.29223
H  3.503797 -0.210265 2.508883
H  0.786615 1.574232 -0.802483
H  0.129852 -2.432236 0.753606
H  -1.716984 1.944343 -0.872195
H  -2.385288 -2.05682 0.652832
