program: Gaussian 09
title: 000166780
version: EM64L-G09RevD.01
frameworkgroup: C1[X(C13H7ClN2O3)]
method: RPBEPBE
basis: SDD
operation: Freq
keyword: #p
keyword: freq=noraman
keyword: PBEPBE/SDD
title: #p freq=noraman PBEPBE/SDD
converged: NO NO NO YES
title: Mulliken charges:
elementType: Cl O O O N N C C C C C C C C C C C C C H H H H H H H
charge: -0.036293 -0.224686 -0.164337 -0.164349 -0.476565 0.003802 0.073599 0.434818 0.190718 0.261099 0.091366 0.311881 -0.368095 -0.349190 -0.381673 -0.358832 -0.242302 -0.257298 -0.205225 0.322945 0.284422 0.239697 0.269442 0.267205 0.240936 0.236915
chargesum: 0.00000
title: Mulliken charges with hydrogens summed into heavy atoms:
elementType: Cl O O O N N C C C C C C C C C C C C C
charge: -0.036293 -0.224686 -0.164337 -0.164349 -0.153620 0.003802 0.073599 0.434818 0.190718 0.261099 0.091366 0.311881 -0.368095 -0.064768 -0.141976 -0.089390 0.024903 -0.016362 0.031690
polarizability: 2.65844983e+02 -1.20878059e+00 2.16074871e+02 2.88656876e-03 -3.82726136e-03 8.07958803e+01
1716.lowfreq: -0.0022 -0.0009 0.0014 3.8908 4.6728 9.3404 23.0457 75.2494 81.3164
frequency: 22.8049 75.2466 81.3052 92.7170 129.5088 149.5117 168.6339 208.7041 251.5032 270.1675 287.3910 298.6839 319.5179 368.3548 398.1655 413.2302 439.9406 497.7587 499.9151 532.5620 545.8973 600.7777 625.5605 635.7554 650.0272 651.4402 685.2445 686.9949 723.2701 733.9400 773.9004 791.8676 804.5092 819.2629 875.8631 879.0142 922.4744 934.7481 973.3605 974.2133 1003.8938 1032.3478 1108.3590 1122.2872 1147.7518 1174.5240 1185.0038 1231.9591 1257.4925 1263.3075 1279.6141 1308.2686 1381.1315 1385.9955 1402.1486 1417.4999 1438.2893 1447.4191 1479.1355 1516.0606 1542.8151 1569.7901 1589.9782 1623.5337 1626.3923 3126.6130 3146.5187 3157.1730 3167.6901 3174.4509 3184.9455 3508.9449
redmass: 12.3695 6.4525 6.8077 8.5330 9.9114 6.8423 14.4693 7.7424 5.4279 7.6165 13.0600 5.0674 12.1030 8.0701 5.8544 7.2564 4.0679 3.9663 8.6263 3.3469 9.7961 7.1254 2.0780 6.9959 2.3227 8.9955 2.8680 6.8214 11.2073 4.9297 1.5156 8.2891 3.0000 1.5891 5.6860 1.5505 7.3529 1.3540 1.3691 6.8973 1.3374 2.0764 2.0448 2.4787 2.5904 1.0815 1.8288 3.4848 1.8907 3.9754 2.1880 2.5252 3.2868 14.6415 10.1161 3.7778 2.8834 3.0286 2.7111 4.1443 9.5186 5.0996 7.9507 5.7988 7.2661 1.0883 1.0892 1.0937 1.0892 1.1002 1.0977 1.0769
irintensity: 0.3458 4.0909 0.2050 0.0299 0.2433 0.0329 5.0935 0.0270 0.0019 0.8514 2.6295 2.4255 24.1259 4.3538 0.0072 11.2517 0.4977 8.4902 11.1809 17.5889 12.0734 3.2430 2.8143 4.7674 56.2312 16.4669 5.1554 11.4249 4.8265 1.0312 109.0347 34.1882 16.9823 33.2850 6.5771 1.2063 29.9221 0.1767 2.6515 1.2572 0.3001 5.8050 17.9635 40.3120 39.4141 2.3447 0.7997 50.3185 24.3988 37.8669 5.9233 27.2147 26.9697 172.0849 35.0570 17.4381 30.0291 8.8911 61.7301 177.2561 156.8177 17.7231 52.6303 288.7596 21.7665 4.5858 9.2704 4.5886 0.3516 23.3561 0.0305 71.6064
temp: 298.150 k
press: 1.00000 atm
elementType: 17 8 8 8 7 7 6 6 6 6 6 6 6 6 6 6 6 6 6 1 1 1 1 1 1 1
symmnumber: 1
zpe: 459336.6 jmol-1
zpe.correction: 0.174952 hartree
zpe.thermalcorrener: 0.189801 hartree
zpe.thermalcorrenthalpy: 0.190745 hartree
zpe.thermalcorrgfe: 0.131895 hartree
zpe.sumelectzpe: -1293.458516 hartree
zpe.sumelectthermal: -1293.443667 hartree
zpe.sumelectthermalent: -1293.442723 hartree
zpe.sumelectthermalfe: -1293.501573 hartree
dipole: 3.6061 7.0710 -0.0001
dipole: 7.9374
quadrupole: -92.7182 -126.1243 -122.1890
quadrupole: -10.5236 0.0024 -0.0006
quadrupole: 20.9590 -12.4471 -8.5118 -10.5236 0.0024 -0.0006
hfenergy: -1293.6334682 hartree
pointgroup: C01 [X(C13H7Cl1N2O3)]
dipole: 1.517113 2.7295345 -0.0000301 debye
dipolederiv: -0.1467863 -0.1856453 0.0000002 -0.0283784 -0.7679905 0.0000245 -0.0000014 0.0000284 -0.0366031 -0.7032537 -0.1412036 0.0000066 -0.1473698 -0.9935749 0.0000309 0.0000203 -0.0000379 -0.2765577 -0.4389152 -0.2156852 -0.1207418 -0.2201591 -0.4967491 -0.1669132 -0.1421424 -0.0534571 -0.6910741 -0.4388799 -0.215628 0.1208812 -0.2201511 -0.4967011 0.1668535 0.1422581 0.0534379 -0.6911263 -1.480492 0.2852361 -0.0000394 0.2070823 -0.4933017 0.0000264 -0.0000429 0.0000304 -0.2656248 0.7611494 0.4710124 -0.0001759 0.3873074 0.8138506 0.0000657 -0.0002285 -0.0000479 1.2569961 -0.380407 0.5049566 -0.0000289 -0.1050742 -0.3483539 0.0000049 -0.0000353 0.0000322 -0.0180309 1.2388768 -0.0090062 0.0000303 0.3285517 -0.2356585 0.000009 0.0000005 0.0000274 0.1594576 -0.5981613 -0.3264654 -0.000006 0.0213364 -0.2146526 0.0000053 -0.0000056 -0.0000136 -0.0461265 0.8777531 -0.5168183 0.0000311 -0.4693646 0.4395156 -0.0000382 0.0000584 -0.0000201 0.1164107 1.1693022 -0.0060769 0.0000326 0.1338597 1.1559749 -0.0000111 0.0000828 0.000055 0.1548015 0.3442676 -0.2843178 0.0000454 0.1061067 0.2478431 -0.0000415 0.0000408 -0.0000284 -0.0359074 -0.335235 0.130272 0. 0.2208825 1.1545266 -0.0000334 -0.0000061 -0.0000575 -0.1273688 0.1384526 0.2131382 -0.0000076 -0.1770912 0.0534166 -0.0000085 -0.000009 -0.0000048 -0.0842724 -0.3985874 0.3294007 -0.0000167 0.0961218 0.0241925 -0.0000064 -0.0000086 -0.0000044 -0.2025663 -0.1115365 0.1283558 0.000003 -0.0612389 -0.3715246 0.0000148 0.0000153 0.0000579 -0.13754 0.1484041 0.126207 0.0000014 0.0347861 0.0401717 -0.0000042 0.0000064 -0.0000009 -0.0520064 -0.1494189 -0.2636424 0.0000018 -0.1666375 -0.1454668 0.0000005 0.0000056 0.000003 -0.1758932 0.1702136 -0.0334721 0.0000024 0.0743255 0.2680477 -0.0000084 0.0000003 -0.0000103 -0.1138545 0.1924469 -0.0189844 -0.0000003 -0.0297867 0.2622861 -0.000002 -0.0000047 -0.0000158 0.2989953 0.1313774 -0.0637554 0.0000032 0.0121009 0.0208306 0.0000058 0.0000071 -0.0000007 0.1505553 0.0804951 0.0179242 -0.0000006 -0.0465793 -0.0958537 0.0000079 -0.0000011 0.000014 0.1727629 0.0065956 -0.0204876 -0.0000085 -0.0477545 0.0617915 0.0000028 0.0000063 0.0000061 0.161922 0.0630636 0.0582943 -0.0000093 0.0596988 0.0302962 0.0000089 -0.0000135 0.0000045 0.1618265 -0.038158 0.0909591 -0.0000041 0.1013937 0.0061341 0.0000041 -0.0000035 0.0000036 0.1662849 -0.102567 -0.0545676 -0.0000002 -0.0639681 0.0809498 0.000002 0.0000006 -0.0000012 0.1545397 unknown
polarizability: 265.6953871|-2.9806318|216.2244667|0.0027482|-0.0039278|80.7958803 unknown
InChI: InChI=1S/C13H7ClN2O3/c14-8-5-6-10(16(18)19)11-12(8)15-9-4-2-1-3-7(9)13(11)17/h1-6,15H
charge 0 multiplicity 1
26 atoms
Cl -0.857562 4.046719 0.000038
O  -0.017065 -2.388443 0.00011
O  -2.879181 -2.320376 -1.144571
O  -2.879488 -2.320108 1.14525
N  0.986966 1.64176 0.000202
N  -2.622982 -1.793452 0.000314
C  -0.739871 -0.088161 0.000228
C  -0.355022 1.292842 0.000176
C  1.704587 -0.691736 0.000297
C  2.0224 0.700643 0.000263
C  0.299187 -1.153869 0.000296
C  -2.128299 -0.384018 0.000183
C  -1.369674 2.2937 0.000083
C  2.763591 -1.638988 0.000309
C  3.377845 1.127695 0.000249
C  -3.118107 0.607645 0.00003
C  -2.727512 1.970239 -0.000002
C  4.102289 -1.220352 0.000308
C  4.404983 0.170364 0.000275
H  1.215536 2.639913 0.000223
H  2.489193 -2.699022 0.000328
H  3.615413 2.198028 0.000211
H  -4.176722 0.335481 -0.00002
H  -3.481489 2.761929 -0.000079
H  4.912228 -1.956054 0.000329
H  5.449157 0.501521 0.00027
