program: Gaussian 09
title: 000166761
version: EM64L-G09RevD.01
frameworkgroup: C1[X(C5H12O4)]
method: RPBEPBE
basis: SDD
operation: Freq
keyword: #pfreq=noraman
keyword: PBEPBE/SDD
title: #p freq=noraman PBEPBE/SDD
converged: NO YES NO NO
title: Mulliken charges:
elementType: O O O O C C C C C H H H H H H H H H H H H
charge: -0.467122 -0.476621 -0.467159 -0.451898 -0.072675 -0.084268 -0.108173 -0.400731 -0.712015 0.198595 0.215183 0.242192 0.242070 0.226414 0.236653 0.228027 0.233248 0.361748 0.364084 0.346082 0.346368
chargesum: 0.00000
title: Mulliken charges with hydrogens summed into heavy atoms:
elementType: O O O O C C C C C
charge: -0.105374 -0.112537 -0.121078 -0.105530 0.125920 0.130915 0.134019 0.067753 -0.014087
polarizability: 7.94072348e+01 1.80067976e+00 6.44777057e+01 -2.12436478e+00 -3.31722530e-02 6.30887551e+01
1716.lowfreq: -16.7580 -9.9611 -0.0006 0.0006 0.0007 12.0291 64.7744 76.8970 113.6710
frequency: 64.7512 76.8911 113.6441 123.4317 220.8444 242.9839 257.8354 271.5521 304.1136 320.2890 323.1948 401.3292 425.9031 469.5552 538.3865 574.8393 580.8452 656.5293 807.4328 861.1715 881.9551 941.8741 966.7377 1014.9195 1042.4100 1052.7379 1055.9980 1089.5102 1111.8975 1146.9848 1224.0776 1234.1648 1268.4485 1283.4755 1286.7652 1306.8845 1328.9746 1335.9726 1368.4339 1372.7803 1402.5948 1434.0374 1454.5022 1473.1018 1474.7394 2922.7892 2953.0357 2999.5594 3019.8144 3029.4524 3095.8629 3101.1471 3104.9217 3470.5376 3501.6057 3560.1994 3563.1038
redmass: 3.3198 5.0679 3.4262 4.7192 1.3969 4.5985 2.3539 3.0609 1.2278 4.2598 1.1255 3.3454 2.7083 3.2875 1.0942 2.3382 1.2524 3.0896 3.5322 2.5915 3.1209 4.3682 2.5823 1.7770 2.3121 1.6164 2.1636 1.8558 2.1215 1.4246 1.4075 1.2140 1.1158 1.2111 1.2540 1.2270 1.2676 1.3040 1.2651 1.2708 1.4762 1.8903 1.0819 1.0436 1.0541 1.0818 1.0851 1.0356 1.0581 1.0868 1.1077 1.0999 1.0999 1.0644 1.0650 1.0662 1.0663
irintensity: 4.1677 10.9327 3.6170 1.8080 1.6286 6.5266 9.0961 47.7500 42.4514 9.0944 122.1808 0.9727 14.6782 1.7383 158.8268 112.5800 144.8262 17.5207 24.4925 13.2387 26.0364 110.8414 91.8895 34.7376 10.4283 0.9108 19.9596 31.7685 6.8941 74.7764 37.7893 65.2276 3.0828 81.5882 3.5679 0.7279 10.0316 27.3973 20.3592 6.8045 23.6120 0.2068 8.3035 13.3078 6.6027 34.9157 81.1755 14.4762 26.0556 21.8701 22.6619 22.1774 25.2862 31.5601 26.9593 7.0030 7.1667
temp: 298.150 k
press: 1.00000 atm
elementType: 8 8 8 8 6 6 6 6 6 1 1 1 1 1 1 1 1 1 1 1 1
symmnumber: 1
zpe: 457640.6 jmol-1
zpe.correction: 0.174306 hartree
zpe.thermalcorrener: 0.185422 hartree
zpe.thermalcorrenthalpy: 0.186366 hartree
zpe.thermalcorrgfe: 0.138050 hartree
zpe.sumelectzpe: -497.828466 hartree
zpe.sumelectthermal: -497.817351 hartree
zpe.sumelectthermalent: -497.816406 hartree
zpe.sumelectthermalfe: -497.864722 hartree
dipole: 0.0511 -0.0311 -0.0622
dipole: 0.0863
quadrupole: -58.4332 -57.4045 -49.6994
quadrupole: 0.9813 -9.2643 -3.7286
quadrupole: -3.2542 -2.2255 5.4797 0.9813 -9.2643 -3.7286
hfenergy: -498.0027726 hartree
pointgroup: C01 [X(C5H12O4)]
dipole: 0.0219872 -0.0134628 -0.022076 debye
dipolederiv: -0.4077061 0.0069609 -0.0907151 -0.0190794 -0.7719881 -0.0691877 -0.1311994 -0.050783 -0.5281518 -0.3816348 -0.0237576 -0.0846874 -0.0375729 -0.7596661 -0.0806348 -0.1270672 -0.0699175 -0.5504326 -0.9254829 -0.0463263 0.1889329 -0.0347795 -0.6056728 0.1027072 0.1336432 0.0977915 -0.2099331 -0.9691259 0.02159 0.0974979 -0.0145784 -0.5599689 0.072694 0.1116845 0.0839607 -0.1590194 0.162647 0.0186685 0.0872363 0.1793992 0.4075807 0.0931109 0.0699704 0.0980464 0.4011959 0.1336805 0.0117338 0.0899794 0.1613927 0.4243152 0.1258487 0.0736549 0.1178944 0.4092921 0.5902653 0.1424951 -0.1282905 0.0216395 0.3511581 -0.1255098 -0.1326248 -0.1406323 0.3229944 0.5920597 0.1378231 -0.0954563 0.0331496 0.2370604 -0.072348 -0.136337 -0.0688481 0.2428741 -0.028008 0.0245508 -0.0377696 0.0047526 -0.0118327 0.1041554 0.007057 0.0849145 -0.1282695 0.006565 0.0066956 -0.0147975 0.0044378 -0.0293364 0.0472304 -0.016712 0.0160343 -0.2481487 0.0417477 -0.0113522 0.0094474 -0.0041594 -0.018369 0.0172059 -0.0039696 -0.0099389 -0.2157349 0.0393699 -0.0071791 0.0238612 -0.0110007 -0.0653345 -0.0675128 0.0026831 -0.09293 -0.0689932 0.0450145 -0.0083393 0.0242755 -0.0213167 -0.0900222 -0.063873 0.0231598 -0.1065827 0.0403346 0.0269166 -0.0168574 0.0167799 -0.0247665 0.0779742 0.0217295 -0.0011126 0.0737045 -0.1129894 -0.0059274 -0.1198911 0.0481208 -0.1139025 0.0112876 0.0283523 0.0447935 0.0210168 0.0720368 0.1122894 0.0131938 0.0220997 -0.0036665 -0.0197137 -0.1365162 0.0098959 -0.0704215 -0.0033661 -0.0990671 0.1192588 -0.0495588 0.1020992 0.0536207 0.0184169 -0.0200823 0.0195486 0.0846304 0.1826632 -0.0966693 0.0116663 -0.0601972 0.3942043 -0.0076804 0.0536208 -0.0123049 0.3094644 0.1568845 -0.0832162 0.0044917 -0.046039 0.3701696 -0.0001342 0.0498829 -0.0011157 0.3314699 0.3624527 -0.0392313 -0.0690615 -0.0509521 0.2913892 0.0136112 -0.0128756 0.027129 0.0001798 0.3643962 -0.0501507 -0.0540521 -0.0648597 0.3131444 -0.0216655 0.0019343 -0.0165662 0.0105664 unknown
polarizability: 79.5154224|2.0936067|64.5779732|-1.1959594|-0.0750752|62.8803 unknown
InChI: InChI=1S/C5H12O4/c1-3(7)5(9)4(8)2-6/h3-9H,2H2,1H3
charge 0 multiplicity 1
21 atoms
O  0.488981 1.780373 0.322473
O  -1.032435 -1.410806 -0.722477
O  2.799773 0.522676 -0.476105
O  -3.414069 -0.039252 -0.112959
C  0.360983 0.540198 -0.452394
C  -0.954446 -0.119083 -0.024587
C  1.611036 -0.35193 -0.228865
C  -2.179747 0.738624 -0.37561
C  1.768908 -0.885186 1.194617
H  0.303734 0.775744 -1.540361
H  -0.931069 -0.281691 1.075584
H  1.59269 -1.188088 -0.952746
H  -2.160307 1.695028 0.177184
H  -2.210778 0.937465 -1.460586
H  0.983956 -1.629311 1.412848
H  1.703599 -0.066029 1.932145
H  2.75188 -1.373781 1.299118
H  1.454849 2.021736 0.271425
H  -1.995152 -1.66138 -0.737305
H  2.931951 0.622933 -1.453323
H  -3.588338 -0.051439 0.862424
