program: Gaussian 09
title: 000166831
version: EM64L-G09RevD.01
frameworkgroup: C1[X(C15H20O4)]
method: RPBEPBE
basis: SDD
operation: Freq
keyword: #pfreq=noraman
keyword: PBEPBE/SDD
title: #p freq=noraman PBEPBE/SDD
converged: NO YES NO NO
title: Mulliken charges:
elementType: O O O O C C C C C C C C C C C C C C C H H H H H H H H H H H H H H H H H H H H
charge: -0.403155 -0.272488 -0.370868 -0.259226 0.268067 0.338545 -0.558484 -0.505178 -0.465308 0.304934 -0.822136 -0.763089 -0.768023 -0.079930 -0.030687 -0.010220 -0.045304 0.285500 -0.775865 0.284831 0.215199 0.225855 0.204641 0.224370 0.215789 0.210794 0.232947 0.274939 0.204101 0.229390 0.227322 0.239394 0.208846 0.212292 0.388194 0.249885 0.244204 0.251157 0.388763
chargesum: 0.00000
title: Mulliken charges with hydrogens summed into heavy atoms:
elementType: O O O O C C C C C C C C C C C C C C C
charge: -0.014961 -0.272488 0.017894 -0.259226 0.268067 0.338545 -0.058453 -0.074682 -0.025149 0.304934 -0.103456 -0.102276 -0.107490 -0.079930 -0.030687 -0.010220 -0.045304 0.285500 -0.030618
polarizability: 2.10795367e+02 -1.04036889e+01 2.01023824e+02 4.43315417e+00 -3.58184690e+00 1.21845935e+02
1716.lowfreq: -15.8980 -14.0414 -2.2297 0.0001 0.0006 0.0009 7.5486 29.3096 47.0559
frequency: -14.0735 28.2368 46.8995 69.5135 101.3022 122.2426 127.9779 153.8347 180.8582 209.2145 221.7737 234.2456 251.7710 256.9484 262.5674 288.7614 309.4005 332.1909 348.0319 356.1799 369.0843 384.3916 399.2494 412.2464 433.5479 455.4149 465.6648 486.6928 502.7535 565.4820 582.3229 624.2018 654.1945 706.9898 714.3275 741.5074 749.8799 768.8121 793.3851 820.5589 836.2028 844.1029 884.4509 898.4312 917.2321 935.9986 942.0975 966.8816 982.0572 992.4045 1005.8058 1040.2923 1050.4079 1063.5610 1069.1457 1097.5147 1138.6074 1155.4159 1182.0248 1186.0482 1208.2732 1215.7131 1226.5231 1245.7778 1249.2993 1262.3889 1288.1616 1294.8769 1302.1238 1323.7501 1338.1871 1366.1216 1379.5987 1386.3882 1400.4256 1404.0216 1456.7140 1459.4370 1462.9836 1465.6930 1469.1938 1479.5767 1481.5067 1484.7158 1489.9650 1500.3884 1507.1041 1518.0834 1549.4487 1606.7146 1676.1024 2974.3984 2980.5309 2990.6038 2990.6501 2992.8012 3004.6671 3021.2831 3038.3472 3059.8170 3064.3208 3068.5658 3072.9882 3077.3575 3079.3331 3081.3974 3093.0997 3115.1660 3129.0575 3133.6611 3170.6437
redmass: 1.0162 4.3132 4.2661 2.3030 8.3319 4.1230 2.2606 5.9977 1.7280 3.3168 1.6197 2.1581 1.8866 2.6705 1.6264 2.2419 2.0031 4.9098 2.3673 2.6616 2.7112 3.0421 4.3667 10.6732 6.7153 3.9031 3.0612 5.8267 8.2890 4.7089 5.3079 5.7441 3.3460 5.3101 5.0571 4.4243 5.8655 1.6048 1.1429 1.0967 1.9575 1.8547 2.8310 2.8092 2.6842 1.4603 1.7547 1.8287 2.1847 1.8255 1.9387 1.4608 2.6666 2.0177 1.5040 1.8196 2.7867 2.3190 4.1315 2.9203 1.6156 2.0763 1.5206 4.2865 2.0935 2.1018 1.4081 1.9283 1.5015 1.3643 2.4644 3.3190 1.2077 1.2003 1.1996 1.3089 1.0624 1.0606 1.0839 1.0656 1.0870 1.0670 1.0596 1.0741 1.0902 1.1667 1.1532 2.8651 8.3527 5.6641 7.4491 1.0359 1.0384 1.0540 1.0408 1.0438 1.0630 1.0698 1.1030 1.1001 1.1015 1.0970 1.0934 1.0954 1.0700 1.0918 1.0985 1.1007 1.0927 1.0962 1.0614
irintensity: 0.2246 0.1629 0.5633 0.0809 0.6709 1.4243 0.3233 0.0852 0.2100 0.1356 0.0955 0.0500 0.2029 1.7810 0.2566 1.1354 1.6795 11.0797 4.1844 0.1561 2.0771 0.1470 29.1022 9.0891 39.5644 2.5988 0.6170 2.3821 1.8905 1.7767 2.8716 14.1709 3.3877 1.0856 0.4600 0.0504 0.3652 8.8669 116.6856 103.3077 0.5463 3.8457 30.2165 16.8984 17.2278 0.6492 2.1469 13.4385 1.4640 3.2369 1.0288 5.6274 4.6699 96.0219 0.5138 20.4423 27.5195 27.7931 38.7827 1.4211 7.4644 12.0932 14.9832 143.5908 20.0215 54.8965 90.7596 356.6893 1.9522 7.7673 409.8413 27.1128 4.5861 52.9724 21.3591 13.4719 14.5483 4.1229 10.6786 11.8217 11.7795 7.0494 8.3805 30.3549 4.9739 10.0196 19.9384 25.8736 124.3987 62.9131 38.9900 24.9056 27.2385 37.0209 21.2767 19.2925 57.4871 54.5956 0.6286 16.0427 21.0759 98.2738 11.2628 52.0797 128.5899 22.0974 43.7760 2.6549 16.3479 5.1776 146.1659
temp: 298.150 k
press: 1.00000 atm
elementType: 8 8 8 8 6 6 6 6 6 6 6 6 6 6 6 6 6 6 6 1 1 1 1 1 1 1 1 1 1 1 1 1 1 1 1 1 1 1 1
symmnumber: 1
zpe: 839535.0 jmol-1
zpe.correction: 0.319762 hartree
zpe.thermalcorrener: 0.338220 hartree
zpe.thermalcorrenthalpy: 0.339164 hartree
zpe.thermalcorrgfe: 0.274321 hartree
zpe.sumelectzpe: -883.032122 hartree
zpe.sumelectthermal: -883.013664 hartree
zpe.sumelectthermalent: -883.012719 hartree
zpe.sumelectthermalfe: -883.077563 hartree
dipole: -0.2884 0.1469 -0.0969
dipole: 0.3378
quadrupole: -113.4269 -119.3083 -113.2305
quadrupole: 3.0549 -0.7052 0.2296
quadrupole: 1.8950 -3.9864 2.0914 3.0549 -0.7052 0.2296
hfenergy: -883.3518836 hartree
pointgroup: C01 [X(C15H20O4)]
dipole: -0.1148992 -0.0208005 0.0635074 debye
polarizability: 211.410124|4.033566|173.6543642|-11.6863741|-36.9812426|148.6006378 unknown
InChI: InChI=1S/C15H20O4/c1-8-10(16)12(18)9(13(19)11(8)17)15(4)7-5-6-14(15,2)3/h16,19H,5-7H2,1-4H3
charge 0 multiplicity 1
39 atoms
O  0.321886 2.023459 -1.321122
O  0.293358 -1.911091 1.535333
O  2.832767 -2.118871 1.329964
O  2.835741 1.740157 -1.522658
C  -1.507743 0.289604 0.495212
C  -2.396324 -0.647162 -0.459832
C  -2.099547 1.708816 0.183329
C  -3.823069 -0.019238 -0.299276
C  -3.635024 1.491001 0.04829
C  0.009986 0.153598 0.236604
C  -1.808842 0.026483 2.006222
C  -2.417669 -2.147755 -0.088263
C  -1.934345 -0.515942 -1.938528
C  0.791324 0.979257 -0.56722
C  0.776862 -0.944439 0.837124
C  2.295452 -1.050347 0.66607
C  2.312629 0.857168 -0.746861
C  3.062132 -0.186702 -0.084581
C  4.555382 -0.297911 -0.254505
H  -1.695645 2.119766 -0.749903
H  -1.84476 2.424983 0.986449
H  -4.372153 -0.539182 0.507967
H  -4.408693 -0.164005 -1.225714
H  -4.161303 1.742222 0.986959
H  -4.052773 2.149251 -0.734249
H  -1.227293 0.731981 2.629131
H  -2.877382 0.20829 2.212359
H  -1.558583 -0.994644 2.324021
H  -3.129776 -2.67922 -0.749037
H  -1.427862 -2.621176 -0.208305
H  -2.742453 -2.311397 0.953636
H  -1.926899 0.532175 -2.284869
H  -0.918622 -0.92886 -2.084074
H  -2.620744 -1.084899 -2.593086
H  1.149509 2.417277 -1.771756
H  4.897851 -1.323188 -0.04247
H  5.085551 0.386404 0.434756
H  4.847839 -0.012197 -1.278759
H  2.044737 -2.59117 1.76414
