program: Gaussian 09
title: 000166753
version: EM64L-G09RevD.01
frameworkgroup: C1[X(C10H14N2O5)]
method: RPBEPBE
basis: SDD
operation: Freq
keyword: #p
keyword: freq=noraman
keyword: PBEPBE/SDD
title: #p freq=noraman PBEPBE/SDD
converged: YES YES NO NO
title: Mulliken charges:
elementType: O O O O O N N C C C C C C C C C C H H H H H H H H H H H H H H
charge: -0.257497 -0.429071 -0.443283 -0.276625 -0.250098 -0.186716 -0.398054 -0.130544 0.002312 -0.551294 -0.043308 -0.377082 -0.238298 0.204079 0.230995 0.087413 -0.771085 0.215041 0.284505 0.238218 0.287233 0.286995 0.211240 0.215552 0.333879 0.341483 0.356701 0.353051 0.239944 0.216613 0.247702
chargesum: 0.00000
title: Mulliken charges with hydrogens summed into heavy atoms:
elementType: O O O O O N N C C C C C C C C C C
charge: -0.257497 -0.087588 -0.090233 -0.276625 -0.250098 -0.186716 -0.041353 0.084497 0.286816 -0.025843 0.243686 0.049710 0.095581 0.204079 0.230995 0.087413 -0.066826
polarizability: 1.76785979e+02 1.52460940e+01 1.47920145e+02 5.84879960e+00 -1.29563980e+00 8.66722313e+01
1716.lowfreq: -13.1504 -8.7564 -0.0008 -0.0006 0.0003 6.4554 32.8757 40.8743 63.7109
frequency: 32.6375 40.8589 63.5702 97.2449 116.6939 123.2401 136.2796 158.0013 182.0754 196.7156 241.6055 269.5446 274.5837 289.4241 296.9211 322.1333 333.6795 378.7309 385.0625 426.4502 456.8071 468.9200 500.1144 552.4056 611.6137 659.5581 704.3690 713.3664 716.8010 738.3610 761.6504 777.0498 805.8246 831.4613 862.1431 930.5459 941.5599 948.2079 970.1437 983.3942 1010.6989 1037.4266 1046.3167 1055.2166 1062.2177 1077.7364 1091.1036 1133.5182 1159.9915 1177.0315 1200.6154 1226.4127 1229.5355 1249.3916 1253.2920 1270.8869 1289.6488 1311.9442 1336.1959 1337.8680 1360.9601 1370.4868 1381.0623 1403.1006 1411.3911 1413.5117 1452.8827 1458.2760 1465.1024 1473.5416 1611.6311 1626.1590 1655.2266 2935.9230 2972.9548 2984.6776 2991.4509 3036.5109 3059.8665 3063.8580 3094.2096 3095.7518 3108.4909 3148.9952 3525.2289 3567.9933 3574.2203
redmass: 4.1795 6.1493 6.7156 4.4985 4.9437 3.3034 1.1201 4.3204 6.3855 3.5832 4.0683 1.1806 3.3935 1.3411 2.7737 5.5582 5.1322 8.6324 6.0381 3.7024 3.3516 4.5384 3.0217 5.0755 4.8023 4.0728 2.0689 5.4727 5.7879 6.2927 4.7564 2.3248 3.5456 3.2548 3.1833 2.7813 2.4249 1.3685 4.5904 2.0214 1.8262 2.7939 2.7533 1.5277 2.5723 2.4541 3.1680 5.6655 1.2510 1.3143 1.1705 3.2724 1.4194 1.4390 1.4930 1.5489 1.3897 1.4673 1.2582 1.5784 1.5681 1.7491 1.5248 1.3926 2.2772 1.9051 1.0441 1.0868 1.0800 1.0759 5.5289 10.4356 5.7723 1.0555 1.0856 1.0363 1.1047 1.0647 1.0881 1.0974 1.0884 1.1004 1.1015 1.0952 1.0770 1.0663 1.0667
irintensity: 5.3947 0.4874 6.5107 5.8495 1.3809 2.5334 0.5728 11.7588 5.7969 13.1047 4.9125 131.4258 10.7374 118.7981 66.3551 4.3353 20.3788 10.7914 2.5421 5.7477 6.1073 11.3447 35.1446 17.8057 0.3499 6.9124 10.5336 13.1953 4.7725 13.9782 0.4994 109.9061 16.2606 3.8628 12.8769 43.5843 40.3537 14.2957 74.2307 18.3939 13.5289 69.9559 57.4828 3.3366 54.6172 43.0347 23.0694 12.7465 59.0266 7.2789 32.8475 9.0709 5.4420 38.3220 62.3552 201.6905 5.8134 16.3906 2.4443 41.3430 1.8330 11.8138 1.4718 47.6166 38.4880 23.3279 11.5827 13.2269 9.8178 3.4123 189.2456 293.2995 566.8789 39.2678 50.5367 24.6385 69.8030 13.5849 9.4796 15.8430 14.0829 15.3557 13.0271 33.7598 53.3229 8.4841 7.2458
temp: 298.150 k
press: 1.00000 atm
elementType: 8 8 8 8 8 7 7 6 6 6 6 6 6 6 6 6 6 1 1 1 1 1 1 1 1 1 1 1 1 1 1
symmnumber: 1
zpe: 634620.5 jmol-1
zpe.correction: 0.241714 hartree
zpe.thermalcorrener: 0.258351 hartree
zpe.thermalcorrenthalpy: 0.259295 hartree
zpe.thermalcorrgfe: 0.197103 hartree
zpe.sumelectzpe: -873.793031 hartree
zpe.sumelectthermal: -873.776394 hartree
zpe.sumelectthermalent: -873.775449 hartree
zpe.sumelectthermalfe: -873.837642 hartree
dipole: -4.6751 1.8633 3.7678
dipole: 6.2869
quadrupole: -116.5658 -93.7194 -99.3187
quadrupole: 4.0739 -13.6153 4.9556
quadrupole: -13.3645 9.4819 3.8826 4.0739 -13.6153 4.9556
hfenergy: -874.0347448 hartree
pointgroup: C01 [X(C10H14N2O5)]
dipole: 1.971793 -0.6345319 1.3518066 debye
polarizability: 172.5752697|18.5828009|151.1012463|-8.5937451|4.3942908|87.7018394 unknown
InChI: InChI=1S/C10H14N2O5/c1-5-3-12(10(16)11-9(5)15)8-2-6(14)7(4-13)17-8/h3,6-8,11,13-14H,2,4H2,1H3
charge 0 multiplicity 1
31 atoms
O  1.683716 -0.186739 -1.07609
O  4.074024 1.450152 -0.231445
O  1.931699 -2.844958 -0.107714
O  -0.956178 2.704586 0.384341
O  -4.334146 -0.525766 0.719861
N  -0.439043 0.476145 -0.143286
N  -2.618405 1.048446 0.536573
C  3.137732 0.693375 0.608133
C  0.960846 0.926702 -0.488889
C  1.763083 1.390448 0.759632
C  2.798821 -0.587847 -0.177673
C  2.410335 -1.751757 0.746209
C  -0.849719 -0.850839 -0.2978
C  -1.319801 1.496534 0.266495
C  -2.134495 -1.269267 -0.02636
C  -3.124566 -0.285146 0.431649
C  -2.584104 -2.69995 -0.196149
H  3.59499 0.473845 1.595792
H  0.863419 1.722527 -1.245302
H  1.256547 1.05418 1.681252
H  1.834639 2.488319 0.800961
H  3.623324 -0.885689 -0.844092
H  1.621621 -1.441066 1.465413
H  3.313997 -2.053428 1.318179
H  -0.070733 -1.529539 -0.660103
H  4.180059 2.363542 0.136474
H  -3.284103 1.766658 0.83959
H  1.809895 -3.661525 0.43842
H  -2.967146 -3.109034 0.756774
H  -1.758079 -3.337563 -0.554446
H  -3.418931 -2.763843 -0.917599
