program: Gaussian 09
title: 000166580
version: EM64L-G09RevD.01
frameworkgroup: C1[X(C8H9NO3)]
method: RPBEPBE
basis: SDD
operation: Freq
keyword: #pfreq=noraman
keyword: PBEPBE/SDD
title: #p freq=noraman PBEPBE/SDD
converged: YES YES NO NO
title: Mulliken charges:
elementType: O O O N C C C C C C C C H H H H H H H H H
charge: -0.470076 -0.435162 -0.388315 -0.387607 0.215632 0.002060 -0.356298 0.189068 0.272331 -0.232119 -0.336303 -0.614057 0.192641 0.228439 0.254750 0.319024 0.286084 0.232360 0.232590 0.404107 0.390851
chargesum: 0.00000
title: Mulliken charges with hydrogens summed into heavy atoms:
elementType: O O O N C C C C C C C C
charge: -0.065969 -0.044312 -0.388315 -0.068583 0.215632 0.002060 -0.163657 0.189068 0.272331 -0.003680 -0.081554 0.136978
polarizability: 1.54571486e+02 3.15653967e+00 1.19906229e+02 -1.12191820e-02 -4.67251763e-04 4.75005076e+01
1716.lowfreq: -7.2123 -0.0012 -0.0009 -0.0004 4.8881 12.2467 54.8808 99.3324 120.9126
frequency: 54.8665 99.3323 120.9076 163.2805 164.8619 217.8124 283.4901 294.8242 334.1782 387.6479 438.4277 483.2269 483.6811 538.8061 554.6620 573.3546 586.0130 616.9299 689.6506 723.3711 763.7863 779.7567 818.7030 869.8391 902.8855 944.7271 970.0218 1052.1054 1068.8349 1122.4461 1133.3889 1167.6083 1180.4122 1202.8312 1229.0050 1304.1428 1315.1803 1342.7636 1411.7343 1429.1075 1454.4612 1459.5952 1472.8489 1488.3259 1543.0814 1580.6050 1611.1353 1639.5106 2650.0512 2985.4941 3066.0550 3120.4746 3122.3793 3154.2789 3177.4607 3472.6480 3579.5357
redmass: 4.0484 1.1524 3.5972 5.3177 3.8919 3.9916 4.8812 5.5403 4.9529 4.7574 10.0058 4.7342 6.6678 1.9951 1.1470 4.8191 1.5533 7.5782 7.0460 1.5979 5.0576 3.4644 5.6627 1.4021 4.6405 1.3224 1.0593 3.3900 2.1707 1.2895 1.6773 2.0818 1.1900 1.7826 3.0867 2.7061 2.2031 1.6485 1.7124 1.6444 4.8935 1.5677 1.5579 1.0446 1.9289 5.4336 4.1374 4.7279 1.0707 1.0352 1.1025 1.0876 1.0983 1.0915 1.0973 1.0643 1.0770
irintensity: 3.0602 0.1305 0.1517 1.2227 5.6059 0.7313 13.6449 0.4011 2.4509 16.5549 11.0036 16.1514 7.3576 0.4681 194.5736 44.9171 36.7389 3.9230 0.0018 103.7726 9.9026 11.9654 11.8323 3.5930 18.3326 3.2188 151.1433 38.6442 14.6267 0.0357 85.9976 49.8194 77.5330 101.1527 8.6898 143.9367 147.4184 301.0896 40.2140 35.0546 148.3420 57.6669 36.6750 18.3913 244.7947 75.9203 12.7219 45.1607 560.8771 68.7962 31.4510 12.1760 1.0547 15.5713 8.9795 72.2236 23.6698
temp: 298.150 k
press: 1.00000 atm
elementType: 8 8 8 7 6 6 6 6 6 6 6 6 1 1 1 1 1 1 1 1 1
symmnumber: 1
zpe: 421064.8 jmol-1
zpe.correction: 0.160375 hartree
zpe.thermalcorrener: 0.171349 hartree
zpe.thermalcorrenthalpy: 0.172293 hartree
zpe.thermalcorrgfe: 0.123584 hartree
zpe.sumelectzpe: -589.816230 hartree
zpe.sumelectthermal: -589.805256 hartree
zpe.sumelectthermalent: -589.804312 hartree
zpe.sumelectthermalfe: -589.853021 hartree
dipole: 3.6919 3.5847 0.0089
dipole: 5.1459
quadrupole: -63.4852 -65.1540 -73.4707
quadrupole: 4.6306 0.0452 -0.0047
quadrupole: 3.8848 2.2159 -6.1007 4.6306 0.0452 -0.0047
hfenergy: -589.9766051 hartree
pointgroup: C01[X(C8H9N1O3)]
dipole: 1.4228503 1.4371346 -0.0946552 debye
dipolederiv: -0.7063827 0.1795584 0.0107283 0.0688176 -1.2178283 0.012951 0.0145978 0.0082939 -0.4019333 -0.7853588 -0.606507 0.0312742 -0.6677712 -0.7989918 0.0414507 0.032607 0.0382082 -0.4145514 -0.8815742 0.11758 0.0215363 -0.0620862 -1.00516 0.0125113 0.0231578 0.0038223 -0.3947072 -1.2351037 -0.2789565 0.0414575 -0.4450146 -0.4718542 0.021701 0.0418251 0.0132591 -0.4643701 -0.7740199 0.0184707 0.0365518 0.37581 -0.1142216 -0.0170731 0.0306435 0.0006002 -0.015584 0.0297371 -0.5983264 0.0127345 0.0304829 0.9296416 -0.0192469 0.0004581 0.01202 0.0327836 0.0819743 0.0523373 -0.0147 -0.3049835 -0.0562459 0.0119048 -0.0089459 -0.0054084 -0.1877615 0.6748694 0.9144577 -0.0492122 0.6724179 0.501507 -0.04274 -0.0448586 -0.0549029 0.0715471 1.9260882 0.1337228 -0.0817066 0.3219922 1.1305481 -0.0285688 -0.0834645 -0.0203923 0.2528971 -0.211452 -0.0844188 0.003759 0.0285277 0.0784642 -0.007172 0.0015061 -0.0016764 -0.169211 0.0976237 0.0324491 -0.013681 -0.102695 -0.0524867 0.0028795 -0.0108608 -0.0038521 -0.1649109 0.5407065 0.0310699 -0.0153293 -0.2260221 -0.0018355 0.0154094 -0.0089868 0.0037168 0.2557869 -0.0602149 -0.1284414 0.0136871 -0.1058166 0.0027104 0.0087484 0.0135295 0.0098773 0.1601668 0.0675654 0.0423041 0.0039288 0.0571944 -0.1058583 0.0031622 0.0036781 0.0040335 0.1654929 -0.0564197 0.0380795 0.0104357 0.0376371 0.0982002 -0.000258 0.0106102 -0.0002798 0.1710499 0.1852879 0.0554653 0.0065062 0.0869922 0.1290776 -0.0010139 0.0062476 0.0007099 0.3357343 0.1624969 -0.0460917 -0.0001732 0.0855485 -0.0023343 -0.0010583 -0.0026426 0.0051226 0.1349239 -0.1008953 -0.0341346 -0.0622271 -0.0328552 0.0939629 -0.0887335 -0.1357921 -0.0750904 -0.0516206 -0.0820352 -0.0244687 0.0657313 -0.01808 0.100196 0.0847209 0.1397641 0.0713787 -0.0783543 0.7841273 0.0330137 -0.0204968 0.0460821 0.4270244 -0.003062 -0.0220328 -0.00285 0.3723324 0.3429796 0.1528366 -0.0008044 0.1538218 0.3354844 -0.0065126 -0.001041 -0.0065899 0.3902895 unknown
polarizability: 154.1796357|3.7291458|120.0077357|-5.2769024|-1.6412503|47.7908513 unknown
InChI: InChI=1S/C8H9NO3/c1-9-8(12)5-3-2-4-6(10)7(5)11/h2-4,9-11H,1H3
charge 0 multiplicity 1
21 atoms
O  -0.589948 -2.029052 0.004689
O  -3.149965 -1.222867 0.11649
O  1.84907 -1.512491 -0.12999
N  2.697782 0.642122 -0.204488
C  0.252421 0.302277 -0.08367
C  -0.796885 -0.659446 -0.012468
C  -0.095842 1.686694 -0.096391
C  -2.160054 -0.245096 0.046717
C  1.63958 -0.228538 -0.140805
C  -1.442872 2.083432 -0.038582
C  -2.483792 1.119147 0.033613
C  4.093346 0.188976 -0.265504
H  0.676396 2.463195 -0.152094
H  -1.699105 3.147423 -0.049478
H  -3.535217 1.417233 0.079074
H  2.508782 1.643871 -0.210129
H  4.090202 -0.911349 -0.242858
H  4.669455 0.565602 0.599249
H  4.579402 0.528826 -1.198181
H  0.447709 -2.157392 -0.046998
H  -2.700164 -2.112666 0.112604
