program: Gaussian 09
title: 000166578
version: EM64L-G09RevD.01
frameworkgroup: C1[X(C5H7NO7)]
method: RPBEPBE
basis: SDD
operation: Freq
keyword: #pfreq=noraman
keyword: PBEPBE/SDD
title: #p freq=noraman PBEPBE/SDD
converged: YES YES NO NO
title: Mulliken charges:
elementType: O O O O O O O N C C C C C H H H H H H H
charge: -0.464535 -0.405191 -0.180436 -0.190651 -0.399374 -0.233267 -0.241495 0.113424 -0.051789 -0.159028 -0.541076 0.158387 0.198307 0.317314 0.291573 0.312107 0.307688 0.383870 0.398314 0.385858
chargesum: 0.00000
title: Mulliken charges with hydrogens summed into heavy atoms:
elementType: O O O O O O O N C C C C C
charge: -0.080665 -0.006877 -0.180436 -0.190651 -0.013516 -0.233267 -0.241495 0.113424 0.265524 0.132545 0.078720 0.158387 0.198307
polarizability: 1.06006941e+02 -6.63227198e+00 7.80928106e+01 2.27443513e-01 4.17702041e+00 6.86867612e+01
1716.lowfreq: -9.5016 -0.0006 -0.0005 -0.0005 2.9170 8.3732 31.9696 43.8082 62.4989
frequency: 31.8231 43.8056 62.4932 70.5362 108.6000 135.0479 140.5738 196.7299 256.1108 266.3741 313.0330 343.7345 370.3398 427.0205 472.3948 505.1086 515.2930 556.5955 582.0352 604.1228 619.3251 648.3146 665.8716 752.0695 788.1555 862.9633 904.1722 934.5088 979.5893 1044.2709 1059.5914 1088.7682 1131.5509 1190.9485 1208.6151 1242.7587 1252.1880 1279.1840 1287.6802 1311.6249 1316.6792 1373.8576 1387.3656 1419.2032 1439.4023 1653.0167 1656.4981 2982.4996 3022.6962 3041.5462 3085.4503 3474.2936 3515.3729 3529.6260
redmass: 11.2403 13.0037 6.4956 6.3713 9.8386 8.8319 7.7062 5.5494 6.8103 4.5284 6.7555 1.4437 4.0320 5.2087 2.9893 1.8710 4.5908 4.4601 5.1738 1.6441 3.3659 1.5372 4.1943 4.7869 7.7809 5.8275 4.1992 2.3830 3.6127 2.7266 2.4003 2.1663 2.3439 1.2564 2.5884 1.3014 1.6746 1.4801 1.7028 1.8485 1.2951 2.1421 1.9874 6.3664 1.0950 8.3387 9.1373 1.0820 1.0617 1.0825 1.0991 1.0654 1.0641 1.0645
irintensity: 0.8056 2.1718 0.7036 1.5216 1.4002 3.7543 4.6734 3.4369 3.4860 4.5824 7.7604 95.9588 16.7787 41.6886 5.5673 39.3411 4.1317 78.3625 35.8433 123.6800 18.3340 124.3969 56.3932 11.8979 23.4480 7.5275 2.4033 70.5320 46.3479 259.1566 222.9098 59.0900 42.6443 2.6304 69.0402 27.4630 24.2996 19.2068 31.7253 29.4706 6.6758 142.3391 55.1945 112.2882 64.1127 209.4648 216.6451 10.5192 12.5255 7.6539 2.1008 55.3083 37.8417 47.8849
temp: 298.150 k
press: 1.00000 atm
elementType: 8 8 8 8 8 8 8 7 6 6 6 6 6 1 1 1 1 1 1 1
symmnumber: 1
zpe: 353804.1 jmol-1
zpe.correction: 0.134757 hartree
zpe.thermalcorrener: 0.148095 hartree
zpe.thermalcorrenthalpy: 0.149039 hartree
zpe.thermalcorrgfe: 0.093191 hartree
zpe.sumelectzpe: -774.965455 hartree
zpe.sumelectthermal: -774.952117 hartree
zpe.sumelectthermalent: -774.951173 hartree
zpe.sumelectthermalfe: -775.007021 hartree
dipole: -1.8413 -2.0136 -1.5763
dipole: 3.1511
quadrupole: -66.6739 -83.5053 -73.9906
quadrupole: -1.5878 -5.8792 0.7071
quadrupole: 8.0493 -8.7820 0.7327 -1.5878 -5.8792 0.7071
hfenergy: -775.1002118 hartree
pointgroup: C01 [X(C5H7N1O7)]
dipole: 0.7919589 -0.7127617 0.6338142 debye
dipolederiv: -0.333701 -0.0040837 -0.02888 -0.0302671 -0.5341521 -0.039256 -0.1240703 -0.1018691 -0.7132049 -0.2788914 0.0057146 0.1327626 -0.0316953 -0.4573764 0.0675055 0.1095553 0.1100849 -1.2242077 -0.8086266 -0.2173025 -0.049467 -0.0152636 -0.5908235 -0.014355 -0.0689337 0.0081141 -0.1797022 -0.5832567 -0.0341489 -0.0261862 -0.2686482 -0.7857573 -0.0573433 -0.0359003 -0.0137081 -0.2027782 -1.2802905 -0.1859776 0.3162003 -0.1201483 -0.3210671 -0.0407283 0.311202 -0.0207052 -0.4608746 -0.8125779 -0.2623748 -0.2825047 -0.2142254 -0.4589506 -0.0859784 -0.0532496 -0.0623352 -0.7647017 -0.7496573 0.0671075 0.0219401 -0.1451753 -0.6772739 0.3160341 0.1697011 0.2686355 -0.554335 1.1288263 0.1767482 0.0951835 0.1580802 1.079842 0.0492202 0.1449778 -0.046667 0.1122466 0.1557655 0.0728687 -0.0435008 0.0407516 0.0508042 -0.031757 -0.0248513 0.1351942 0.1426816 -0.1604223 -0.073981 0.1878382 0.0226714 0.2893011 0.0576358 0.1226306 0.073437 0.510997 -0.156157 0.0598942 -0.0261209 0.220978 -0.2895885 0.1465215 -0.1672039 0.1450302 -0.0157586 1.0650845 0.3402114 0.1324889 0.3627141 0.6232177 0.0407076 -0.0483168 -0.061079 1.44975 1.6924282 -0.0201377 -0.2628854 0.008974 0.8399845 -0.4853629 -0.3466779 -0.4748393 0.6367163 0.1137027 0.01891 0.0102675 -0.0049118 0.074641 -0.0163421 0.0280712 -0.0394138 0.0112004 0.1229775 0.0608548 -0.0331123 0.0467289 -0.0073293 0.0508907 0.029531 0.0121593 0.003917 0.1050893 0.0443173 -0.0030886 0.0284037 0.1386644 -0.0160294 0.0530373 -0.0095773 0.0432042 0.0929517 -0.0358345 -0.0204257 -0.1074522 0.0815769 -0.0246371 -0.0083203 -0.0268799 0.1260942 0.2117444 -0.0099262 -0.1001757 -0.0006549 0.3524751 -0.0261022 0.0223273 0.0169523 0.4111897 0.1440666 -0.0654636 0.0036427 -0.0437184 0.3843674 -0.0049059 -0.0605462 -0.033317 0.3533989 0.3309438 0.0626039 -0.0239764 0.0928587 0.2074443 0.1142822 -0.0529633 0.1207833 0.3141669 unknown
polarizability: 104.847372|8.603|78.9438891|-0.3126547|-4.6438011|68.9952519 unknown
InChI: InChI=1S/C5H7NO7/c7-3(8)1-2(6(12)13)4(9)5(10)11/h2,4,7,9-10H,1H2
charge 0 multiplicity 1
20 atoms
O  -0.542158 -0.727056 -1.799496
O  -1.889186 -1.230664 1.578452
O  -1.960165 1.423991 0.000612
O  -0.132421 2.756986 0.217832
O  3.866164 -0.060815 -0.39477
O  -2.846854 -1.498914 -0.532434
O  2.418786 -1.319789 0.913734
N  -0.696547 1.608218 0.13959
C  0.199913 0.349112 0.277105
C  -0.481507 -0.881139 -0.357718
C  1.574717 0.634755 -0.347684
C  -1.873101 -1.205174 0.193424
C  2.61311 -0.354646 0.138509
H  0.286685 0.184674 1.367506
H  0.17177 -1.740811 -0.100023
H  1.506511 0.576775 -1.449334
H  1.905924 1.657029 -0.095392
H  -1.486442 -0.871046 -2.084571
H  -2.798443 -1.458364 1.911219
H  4.532244 -0.727121 -0.07196
