program: Gaussian 09
title: 000166577
version: EM64L-G09RevD.01
frameworkgroup: C1[X(C10H12ClNO2)]
method: RPBEPBE
basis: SDD
operation: Freq
keyword: #p
keyword: freq=noraman
keyword: PBEPBE/SDD
title: #p freq=noraman PBEPBE/SDD
converged: NO YES NO NO
title: Mulliken charges:
elementType: Cl O O N C C C C C C C C C C H H H H H H H H H H H H
charge: -0.051225 -0.193169 -0.214843 0.097151 0.306792 -0.646709 -0.715033 -0.707003 0.497589 -0.374770 -0.368465 -0.222742 -0.223166 -0.107170 0.234895 0.262985 0.232042 0.241216 0.231605 0.239211 0.233796 0.244028 0.244457 0.242998 0.257833 0.257697
chargesum: 0.00000
title: Mulliken charges with hydrogens summed into heavy atoms:
elementType: Cl O O N C C C C C C C C C C
charge: -0.051225 -0.193169 -0.214843 0.097151 0.306792 -0.148829 -0.010170 0.010032 0.497589 -0.130314 -0.125467 0.035091 0.034531 -0.107170
polarizability: 1.90781238e+02 1.54521821e+00 1.24621455e+02 -1.10076117e+01 -1.71845173e+00 7.91494961e+01
1716.lowfreq: -9.5551 -1.8073 -0.0022 -0.0014 -0.0005 9.3775 31.0988 42.5825 53.4413
frequency: 31.0313 42.4047 53.4030 75.0352 152.9807 172.2189 196.3011 227.5554 246.8935 272.8643 306.2195 311.7354 340.9963 371.5590 391.4340 400.2911 412.2512 487.8760 504.9723 577.9677 627.9582 636.9147 680.6577 720.6908 756.1394 772.9964 825.4196 833.8917 843.6253 905.4562 942.1761 949.3456 968.4813 978.3208 1001.5668 1015.9861 1074.2061 1096.8476 1133.7803 1134.1182 1186.6502 1208.7451 1214.7468 1227.1886 1290.0952 1304.3321 1312.5759 1376.6740 1379.4803 1396.6625 1399.6966 1406.9830 1461.7911 1462.2701 1472.3150 1478.5901 1478.7164 1490.0764 1584.7044 1600.6328 2998.2811 3000.2165 3004.6396 3067.9369 3096.2749 3103.7017 3108.3797 3111.1628 3133.0678 3135.6437 3170.3106 3173.4061
redmass: 4.9681 8.7902 8.4822 3.8676 5.9700 8.2954 1.3414 2.2485 1.1185 2.8968 4.9376 4.3152 3.4704 3.0269 2.3286 4.9068 2.9047 3.8768 3.6137 4.2387 6.7591 4.1480 7.6021 4.0906 4.7023 4.7424 2.2469 1.2447 2.3229 1.6954 1.3844 1.3729 1.3651 1.9298 4.2530 1.3497 2.7691 1.4784 1.7932 1.3360 1.1312 3.4124 3.9743 3.4810 1.8138 1.5365 1.4217 3.3471 1.8160 2.4226 2.1546 1.7373 1.0566 1.0735 1.0972 1.7316 1.2459 1.0807 7.2257 6.2728 1.0375 1.0567 1.0375 1.1017 1.1000 1.1000 1.0998 1.1006 1.0899 1.0899 1.0950 1.0961
irintensity: 2.4771 0.1199 1.4838 0.4794 1.7779 2.7075 0.0948 0.1474 0.4713 0.9746 1.5429 1.0514 2.6463 3.5510 2.7697 10.2012 0.0014 10.3141 19.2595 4.7311 0.1054 8.0714 2.5186 7.6297 22.5201 21.0664 31.1887 0.0699 46.5601 0.9956 0.9115 0.4559 0.0807 0.2233 37.3650 0.3011 45.0413 1.9331 14.8812 15.7624 0.3457 42.7488 43.9309 44.0782 1.8792 1.7088 4.5736 35.6512 54.9197 8.0237 81.2301 16.8340 0.0926 12.4337 4.0413 47.8399 68.9937 12.9535 0.8544 12.3275 17.4025 9.2774 5.5278 5.0532 10.9776 16.0318 26.2099 10.7317 9.4163 8.8807 5.5274 0.1955
temp: 298.150 k
press: 1.00000 atm
elementType: 17 8 8 7 6 6 6 6 6 6 6 6 6 6 1 1 1 1 1 1 1 1 1 1 1 1
symmnumber: 1
zpe: 528214.2 jmol-1
zpe.correction: 0.201186 hartree
zpe.thermalcorrener: 0.215176 hartree
zpe.thermalcorrenthalpy: 0.216120 hartree
zpe.thermalcorrgfe: 0.159084 hartree
zpe.sumelectzpe: -1052.402284 hartree
zpe.sumelectthermal: -1052.388295 hartree
zpe.sumelectthermalent: -1052.387350 hartree
zpe.sumelectthermalfe: -1052.444386 hartree
dipole: -1.9173 0.3783 1.1221
dipole: 2.2535
quadrupole: -121.2975 -84.2021 -89.6108
quadrupole: 0.9751 5.5022 -2.9382
quadrupole: -22.9274 14.1680 8.7593 0.9751 5.5022 -2.9382
hfenergy: -1052.6034702 hartree
pointgroup: C01 [X(C10H12Cl1N1O2)]
dipole: -0.7451365 0.0606986 0.476607 debye
dipolederiv: -0.8902726 -0.0126049 0.1359776 -0.0117861 -0.1245297 0.0007703 0.173169 0.0015173 -0.0973394 -0.7036249 -0.2941532 -0.0079401 -0.2252651 -0.5730084 -0.1979421 0.1656636 -0.1175205 -0.2823761 -0.568798 0.1104889 0.1776847 -0.038261 -0.6074311 -0.207235 0.1411606 -0.2700769 -0.4165256 1.0736854 0.2164467 -0.2079759 0.2916984 0.8556125 0.4251061 -0.4799618 0.4082192 0.3380792 0.0067675 -0.05193 0.0325547 -0.0838732 0.2199824 0.0037633 0.1138615 -0.0090799 0.2816074 0.1002716 0.0000385 0.0191525 0.0243428 0.0638204 -0.0371303 0.085869 -0.0281763 0.0120681 -0.0510103 0.0048216 0.0062542 0.0230629 -0.076598 -0.0753039 -0.0316999 -0.074864 -0.0483388 -0.0724305 0.0106061 0.0183475 0.0530751 -0.0702352 0.0185559 -0.0063315 0.0349189 -0.0089652 0.2376653 0.0076443 0.0069444 -0.0077139 -0.0620562 0.0076182 -0.1117992 0.0047356 -0.0840834 -0.0227012 -0.0414745 -0.0371952 0.0151892 0.0660163 -0.0008901 -0.038498 0.0118674 -0.1250551 -0.0149822 0.0390577 -0.0380247 -0.005483 0.0678385 0.0066566 -0.0344653 0.0025038 -0.1261964 -0.3265208 0.0606206 0.0355792 0.0955091 0.0108096 -0.0034652 0.0539667 -0.0051839 -0.1095058 -0.3326115 -0.0698378 0.0311261 -0.1108496 0.0073683 0.0111616 0.0456115 0.0108618 -0.1090156 1.265491 0.019225 -0.2505158 0.023355 0.1065462 0.0010972 -0.2842456 0.0000986 -0.0140159 0.00265 -0.0152817 0.0110519 -0.0475904 -0.0538531 0.1164024 0.0038836 0.0597135 0.0215598 0.0390857 0.0113199 0.014601 0.0203451 -0.0178526 -0.0925336 0.0041985 -0.042548 0.0406913 -0.0637436 0.0245622 0.0981466 0.0119303 0.0785803 0.0015262 0.1283112 0.0110505 0.0798758 -0.0081519 -0.0173418 -0.1252001 0.0234724 0.0861214 0.010547 -0.1047147 -0.0032425 -0.0192561 0.1167056 -0.0127782 0.004159 0.0088403 -0.0482743 0.0735233 0.0204302 0.1064872 0.0110671 -0.051346 -0.0149951 0.0863678 -0.0259597 0.077343 0.0115982 0.1313809 -0.0057983 0.0824027 -0.0159051 0.0166542 -0.1286967 -0.0299151 0.0830219 -0.0107035 -0.1190397 0.0269389 -0.037958 0.127157 0.0107811 0.0097374 -0.0011463 -0.0331392 -0.0499252 0.0145512 -0.1062973 0.0289361 0.0235064 0.0958682 0.0383534 0.0861829 -0.0231217 -0.0108608 0.0385321 -0.0195531 0.1315111 0.0266978 -0.0974534 0.0336801 -0.0892619 -0.0320335 0.0054668 0.0341858 0.011356 0.1327055 0.0523537 -0.0639622 0.0165259 -0.064251 -0.0021009 0.0049422 0.0266379 0.0061494 0.1595544 0.0500616 0.0636778 0.0193045 0.0643529 0.0011731 -0.0127455 0.0293426 -0.0140773 0.1585729 unknown
polarizability: 190.2335986|4.1761151|123.813589|-12.8845735|6.2873111|80.505001 unknown
InChI: InChI=1S/C10H12ClNO2/c1-10(2,12(13)14)7-8-3-5-9(11)6-4-8/h3-6H,7H2,1-2H3
charge 0 multiplicity 1
26 atoms
Cl -5.129037 -0.086598 0.44222
O  4.107132 0.917713 0.02926
O  3.586556 -1.077642 -0.927728
N  3.297639 -0.050315 -0.20668
C  1.842139 0.002461 0.400375
C  0.903275 0.002748 -0.859753
C  1.709971 1.274112 1.248155
C  1.687756 -1.27819 1.24875
C  -0.580423 -0.016051 -0.529619
C  -1.282745 -1.2445 -0.414421
C  -1.30732 1.190366 -0.351763
C  -2.663361 -1.277912 -0.117012
C  -2.688152 1.18031 -0.053954
C  -3.34545 -0.05941 0.062928
H  1.144161 0.902631 -1.456956
H  1.172129 -0.879695 -1.466813
H  0.69543 1.306409 1.680541
H  2.442982 1.280291 2.071486
H  1.86953 2.185022 0.647407
H  0.666791 -1.315839 1.663969
H  2.402421 -1.279561 2.090428
H  1.860823 -2.179888 0.638433
H  -0.750792 -2.190109 -0.571073
H  -0.794879 2.153786 -0.456981
H  -3.196704 -2.229316 -0.035842
H  -3.240873 2.115077 0.075845
