program: Gaussian 09
title: 000166770
version: EM64L-G09RevD.01
frameworkgroup: C1[X(C12H20N2O8)]
method: RPBEPBE
basis: SDD
operation: Freq
keyword: #p
keyword: freq=noraman
keyword: PBEPBE/SDD
title: #p freq=noraman PBEPBE/SDD
converged: YES YES NO NO
title: Mulliken charges:
elementType: O O O O O O O O N N C C C C C C C C C C C C H H H H H H H H H H H H H H H H H H H H
charge: -0.469000 -0.496820 -0.423945 -0.476718 -0.489056 -0.518898 -0.444742 -0.460840 -0.145401 -0.115630 -0.248805 -0.044440 -0.258008 -0.166719 -0.090592 -0.070359 0.384546 0.220702 -0.307281 -0.403115 -0.458941 -0.390497 0.268676 0.214654 0.245467 0.234502 0.228217 0.211871 0.195402 0.200013 0.272645 0.225915 0.265084 0.317513 0.381006 0.392548 0.362238 0.382811 0.373616 0.383809 0.365438 0.353133
chargesum: 0.00000
title: Mulliken charges with hydrogens summed into heavy atoms:
elementType: O O O O O O O O N N C C C C C C C C C C C C
charge: -0.087994 -0.104272 -0.061706 -0.093907 -0.115440 -0.135089 -0.079303 -0.107707 -0.145401 -0.115630 0.019871 0.170214 -0.012541 0.067783 0.137624 0.141512 0.384546 0.220702 0.088134 0.095445 -0.193856 -0.072985
polarizability: 2.39890172e+02 7.27502426e+00 1.38671271e+02 -1.56491185e+00 1.06861439e+01 1.54496239e+02
1716.lowfreq: -6.7479 0.0001 0.0004 0.0006 2.0613 5.1144 17.5287 22.3841 38.8270
frequency: 17.0681 21.6704 38.8151 41.3878 64.4100 73.3820 79.1993 90.8601 106.2917 112.7030 126.7798 152.2384 167.3916 196.0840 219.8539 233.5217 247.8498 276.8865 297.4000 303.5056 319.4683 331.5665 339.9017 341.2154 383.9747 400.8661 413.9164 433.1933 439.6952 479.9150 498.7598 508.5959 514.7214 527.2054 542.0100 551.3043 573.2561 580.1761 591.1577 609.3227 641.2719 653.4030 734.6210 777.6695 795.2857 840.4231 855.0996 867.4091 881.6438 908.5181 920.1573 923.9973 947.6276 957.2037 982.2248 995.4425 998.9630 1008.7603 1020.7377 1033.7616 1039.0842 1051.4700 1054.7376 1057.6165 1074.0366 1090.7960 1140.0406 1166.3613 1201.1650 1208.3642 1217.4433 1225.5632 1231.2621 1234.9115 1243.1887 1249.4498 1260.1151 1268.9338 1283.8046 1291.2304 1298.6425 1301.5930 1309.0039 1312.5800 1319.5736 1342.4595 1356.0578 1365.2603 1366.8829 1371.6891 1375.6470 1385.9337 1397.9224 1421.0302 1445.7412 1458.5137 1458.8243 1460.7504 1499.8159 1556.0754 2949.3584 2950.1386 2960.3621 2965.5360 2978.3019 3025.1125 3039.5303 3052.6786 3060.6186 3065.1596 3116.1617 3155.8392 3192.4564 3253.3385 3454.4653 3468.0247 3482.5011 3495.7307 3525.3019 3576.6886
redmass: 6.8041 5.7589 6.8908 5.2887 4.5122 4.9218 5.6683 3.7640 3.8912 6.0131 4.7813 6.0882 7.6970 5.6092 5.7268 5.3123 5.6224 4.9480 3.6469 1.3290 5.5303 4.4575 5.2509 4.4497 3.4837 3.9013 4.5253 5.3122 4.0712 1.1127 1.2385 2.6427 1.5378 2.3189 2.1024 1.4445 1.1793 2.5521 1.9393 4.4017 1.9220 4.7139 4.4576 3.7976 4.6396 4.8701 2.4153 2.5731 1.4528 2.2399 6.3120 1.8840 4.0693 1.3913 4.2167 4.6582 4.4777 2.6098 2.8147 2.7669 2.7140 2.6788 3.0468 2.8275 3.7269 3.2363 1.4005 1.1677 2.2772 2.0837 1.3478 1.5671 1.3586 1.2486 1.2610 1.5919 2.3432 1.2976 1.1914 1.2825 1.3024 1.4577 1.2869 1.4938 1.2724 1.2255 1.1739 1.3360 1.3378 1.4066 1.4874 1.5001 1.3334 1.5457 1.2760 1.3130 1.5332 1.1258 8.1821 5.6513 1.0828 1.0709 1.0825 1.0797 1.0868 1.0724 1.0577 1.0835 1.0863 1.0933 1.1093 1.0934 1.0950 1.0643 1.0645 1.0652 1.0649 1.0649 1.0651 1.0666
irintensity: 0.2838 0.6183 0.6674 4.1679 1.4356 4.7222 2.7980 5.5937 4.1015 1.6293 1.8893 4.5005 6.8348 16.1448 9.8413 9.0034 10.1485 5.0062 50.9325 57.9499 4.0889 12.0568 8.4175 4.1298 6.2804 6.5308 2.1159 5.0357 3.5436 26.1698 350.0019 25.5123 22.1545 54.1223 80.5422 187.2803 62.3806 30.7427 88.1532 32.6310 20.8561 3.0320 7.6454 38.5117 14.9787 7.8523 67.5118 7.6768 131.7964 69.9785 99.9665 69.7257 27.4135 7.4291 66.9999 100.2827 46.7520 25.7873 55.5039 49.5435 82.2462 43.2034 26.3697 14.0431 14.7760 6.7620 36.4776 2.2889 13.9020 24.6796 70.7010 40.8125 2.7393 8.1513 15.8435 23.0773 25.8224 92.7898 24.0408 38.3378 31.5492 15.5087 18.1594 75.9176 8.1370 8.3561 50.8717 89.5759 190.4018 40.7364 12.2207 9.7330 19.4038 49.2249 101.9855 6.5691 46.2242 0.1391 7.4466 0.3486 21.3929 29.6656 7.5162 60.2558 84.3328 492.6715 19.1387 130.4230 12.6980 70.8551 14.0926 14.9887 2.4014 157.8495 101.7023 30.2461 58.0059 35.6882 18.8176 13.8084
temp: 298.150 k
press: 1.00000 atm
elementType: 8 8 8 8 8 8 8 8 7 7 6 6 6 6 6 6 6 6 6 6 6 6 1 1 1 1 1 1 1 1 1 1 1 1 1 1 1 1 1 1 1 1
symmnumber: 1
zpe: 868205.5 jmol-1
zpe.correction: 0.330682 hartree
zpe.thermalcorrener: 0.353845 hartree
zpe.thermalcorrenthalpy: 0.354790 hartree
zpe.thermalcorrgfe: 0.276124 hartree
zpe.sumelectzpe: -1178.773716 hartree
zpe.sumelectthermal: -1178.750552 hartree
zpe.sumelectthermalent: -1178.749608 hartree
zpe.sumelectthermalfe: -1178.828274 hartree
dipole: 3.6665 -2.6181 0.0858
dipole: 4.5061
quadrupole: -129.0864 -146.5452 -133.9842
quadrupole: -1.4940 1.7129 5.9783
quadrupole: 7.4522 -10.0066 2.5544 -1.4940 1.7129 5.9783
hfenergy: -1179.1043979 hartree
pointgroup: C01 [X(C12H20N2O8)]
dipole: -1.3699752 -0.7989117 -0.7923405 debye
polarizability: 236.4168997|-9.6736792|151.5077611|14.9252911|-14.8560813|145.1330205 unknown
InChI: InChI=1S/C12H20N2O8/c15-3-7(17)11(21)9(19)5-1-13-6(2-14-5)10(20)12(22)8(18)4-16/h1-2,7-12,15-22H,3-4H2
charge 0 multiplicity 1
42 atoms
O  4.147637 0.395059 -1.066227
O  -2.052287 1.715208 -1.894611
O  3.793158 -2.393201 -0.663955
O  -3.09309 -1.449487 -0.27817
O  4.587619 2.119512 1.050401
O  -4.500627 2.460964 -1.550559
O  3.720486 1.772344 3.618124
O  -6.593063 1.201729 -0.344646
N  1.532483 -0.23208 -1.004266
N  -0.574519 -1.613928 0.247144
C  4.130325 -0.159557 0.310038
C  -2.802981 0.896965 -0.93674
C  3.250949 -1.434432 0.317024
C  -2.297771 -0.556963 -1.107368
C  3.723368 0.952643 1.298623
C  -4.315219 1.031822 -1.236397
C  1.788807 -1.153654 -0.01062
C  -0.821425 -0.709335 -0.744947
C  3.952898 0.600952 2.776943
C  -5.238545 0.661305 -0.062431
C  0.719511 -1.833551 0.613574
C  0.243745 -0.009078 -1.370903
H  5.175375 -0.458962 0.509476
H  -2.60798 1.244268 0.100877
H  3.323221 -1.952478 1.288493
H  -2.427354 -0.826643 -2.176848
H  2.663167 1.24566 1.141326
H  -4.576385 0.428162 -2.133446
H  4.989383 0.2182 2.901576
H  3.236689 -0.163571 3.124557
H  -5.243202 -0.427349 0.109279
H  -4.922291 1.18326 0.85594
H  0.897633 -2.563068 1.408704
H  0.039215 0.740064 -2.13728
H  3.16537 0.438278 -1.340942
H  -2.612321 2.526689 -2.049933
H  4.098999 -1.849405 -1.442502
H  -2.427661 -1.930766 0.30818
H  4.700344 2.186338 0.063433
H  -5.455319 2.672721 -1.360672
H  4.206347 2.52548 3.188251
H  -7.094292 0.560284 -0.9079
