program: Gaussian 09
title: 000166584
version: EM64L-G09RevD.01
frameworkgroup: C1[X(C21H20ClNS)]
method: RPBEPBE
basis: SDD
operation: Freq
keyword: #p
keyword: freq=noraman
keyword: PBEPBE/SDD
title: #p freq=noraman PBEPBE/SDD
converged: YES YES NO NO
title: Mulliken charges:
elementType: Cl S N C C C C C C C C C C C C C C C C C C C C C H H H H H H H H H H H H H H H H H H H H
charge: -0.066116 0.202133 0.013303 -0.142361 -0.114529 -0.483589 -0.482552 -0.531914 -0.438575 -0.454337 -0.326348 0.185417 0.455878 0.383540 -0.405727 -0.374096 -0.360212 -0.384752 -0.259975 -0.286202 -0.116974 -0.263391 -0.239740 -0.236618 0.218723 0.253299 0.217974 0.210435 0.224503 0.208280 0.234473 0.238680 0.224996 0.230439 0.233275 0.229354 0.243999 0.274856 0.253023 0.254224 0.250853 0.232368 0.260000 0.233985
chargesum: 0.00000
title: Mulliken charges with hydrogens summed into heavy atoms:
elementType: Cl S N C C C C C C C C C C C C C C C C C C C C C
charge: -0.066116 0.202133 0.013303 0.076362 0.138770 -0.055180 -0.049770 -0.058760 0.016860 0.008292 -0.082349 0.185417 0.455878 0.383540 -0.405727 -0.374096 -0.085356 -0.131728 -0.005752 -0.035350 -0.116974 -0.031024 0.020260 -0.002634
polarizability: 3.20096193e+02 -9.80733957e+00 3.16675158e+02 2.80645654e+01 3.99179125e+00 1.68251221e+02
1716.lowfreq: -10.6102 -0.0014 -0.0011 -0.0008 4.8072 6.1726 24.0457 37.3154 44.8078
frequency: 22.5502 37.2115 44.8014 49.2569 77.4656 91.9678 111.7745 132.6865 158.1693 180.4406 211.8295 225.2410 266.3906 281.4851 299.8032 308.3166 356.3477 363.4611 386.9613 397.8244 403.0666 416.5120 440.3425 447.8780 464.3628 489.8697 510.3854 538.9196 543.5827 561.8651 590.6770 610.0637 630.2943 656.0247 666.3985 703.7900 716.9475 743.7370 750.5778 763.2923 771.0680 791.2281 802.2340 809.1277 819.2853 854.5668 869.2280 872.3994 879.7160 902.1186 921.6808 931.7198 943.5716 945.1237 951.3658 972.9111 982.6685 989.2100 1008.9550 1026.2898 1037.9088 1041.7097 1045.6946 1054.9230 1078.2155 1084.2984 1119.7957 1126.0739 1129.8103 1140.8494 1157.5951 1173.7258 1183.3557 1194.2994 1213.2483 1223.4007 1233.9692 1257.5780 1260.1156 1270.8859 1293.5460 1302.9304 1306.8264 1310.3443 1313.5356 1315.8821 1328.1816 1340.5167 1346.0098 1356.1457 1364.1216 1372.0858 1396.4648 1424.5467 1445.3017 1459.4079 1460.6154 1462.5357 1469.1075 1475.5272 1488.4611 1555.3327 1568.0278 1583.5568 1599.3729 1619.3210 2978.3497 2986.0167 2992.7903 2999.9308 3000.4688 3001.4915 3020.0437 3033.5502 3037.7921 3058.0545 3065.8828 3070.4918 3077.3876 3132.0207 3142.7410 3147.7404 3155.9930 3164.3116 3169.3929 3176.8492
redmass: 5.1289 3.9472 4.1819 5.4545 3.5108 5.9530 5.5779 6.1703 4.3921 2.6809 4.0942 5.7856 6.9104 5.8239 2.0222 6.5796 2.7928 7.0312 3.8833 2.7040 3.2776 4.7325 3.9470 3.3813 3.8233 4.3603 6.5000 4.7467 4.2138 3.8041 7.7297 4.8804 4.7709 5.8207 6.3281 6.3527 4.6050 2.9557 3.3833 2.1270 2.8387 2.2786 1.6251 1.3492 1.4180 2.3095 1.4533 2.6473 1.4458 1.6362 2.1471 4.3688 1.3468 1.8551 1.8887 2.0564 1.3374 2.4457 3.4942 5.0554 3.1177 4.8142 2.7166 2.4238 2.4680 1.9519 1.7218 1.9715 1.5419 1.5320 1.3212 1.0598 1.8856 1.6060 1.2862 1.2558 1.5391 1.3691 1.3666 1.4638 1.3434 1.3264 1.3082 1.4889 1.4016 1.3532 1.2884 1.3915 1.4461 2.3765 5.4896 4.5073 2.7215 2.2488 2.6846 1.7365 1.1523 1.2455 1.0918 1.0866 1.0898 6.8600 6.3402 7.3398 6.8300 7.8984 1.0599 1.0592 1.0611 1.0829 1.0610 1.0632 1.0838 1.1042 1.1037 1.1050 1.1051 1.1060 1.0881 1.0851 1.0897 1.0894 1.0944 1.0920 1.1006 1.0966
irintensity: 0.1695 0.0425 0.2618 0.4825 0.0447 1.0921 0.3196 0.1645 0.4782 0.3062 0.0809 0.8131 2.5525 0.3357 0.3926 1.1617 0.5898 3.2163 0.6719 0.1289 0.5198 3.0672 4.3195 0.5309 4.0075 15.2079 17.1966 6.5702 3.6880 1.4353 15.0089 2.5328 6.4356 3.4664 6.6844 5.8826 1.1066 53.8828 8.3338 29.6401 35.8912 10.0200 4.6951 42.2931 13.5649 4.1650 5.2608 0.0417 32.0612 16.9922 26.1430 29.3504 0.0237 4.9525 16.7269 3.9487 0.2277 2.0537 7.7809 49.4924 35.5229 8.1745 5.0561 6.4297 1.8212 37.0950 10.7558 0.2397 4.9956 2.1050 0.4663 0.9127 19.7272 10.6072 3.0803 0.6686 0.9537 17.2301 6.4539 1.1860 5.5571 11.4754 2.2551 10.6652 2.3062 0.4114 0.5687 2.4680 1.7352 3.8615 5.5023 1.0030 31.0338 36.0352 84.2212 18.3776 2.6134 4.9064 17.3884 9.8478 7.8546 6.6186 16.5109 5.4570 18.4763 14.7576 28.6774 13.9192 35.4867 14.9432 89.0778 109.2300 27.6066 5.9215 13.3744 5.1863 28.3779 102.5557 30.7602 0.1535 5.3381 3.5990 19.3292 0.8321 24.5432 3.1937
temp: 298.150 k
press: 1.00000 atm
elementType: 17 16 7 6 6 6 6 6 6 6 6 6 6 6 6 6 6 6 6 6 6 6 6 6 1 1 1 1 1 1 1 1 1 1 1 1 1 1 1 1 1 1 1 1
symmnumber: 1
zpe: 927665.1 jmol-1
zpe.correction: 0.353329 hartree
zpe.thermalcorrener: 0.373231 hartree
zpe.thermalcorrenthalpy: 0.374175 hartree
zpe.thermalcorrgfe: 0.303586 hartree
zpe.sumelectzpe: -1723.377437 hartree
zpe.sumelectthermal: -1723.357534 hartree
zpe.sumelectthermalent: -1723.356590 hartree
zpe.sumelectthermalfe: -1723.427180 hartree
dipole: -1.7222 1.8009 -1.4188
dipole: 2.8674
quadrupole: -148.7383 -151.0197 -161.4220
quadrupole: 2.1332 12.9671 -1.3146
quadrupole: 4.9884 2.7070 -7.6954 2.1332 12.9671 -1.3146
hfenergy: -1723.7307655 hartree
pointgroup: C01 [X(C21H20Cl1N1S1)]
dipole: 0.6766129 0.7362496 0.5223024 debye
polarizability: 320.1710556|11.1059285|316.0382957|27.2025356|-10.9184805|168.8132215 unknown
InChI: InChI=1S/C21H20ClNS/c22-16-5-6-21-19(12-16)18(17-3-1-2-4-20(17)24-21)11-15-13-23-9-7-14(15)8-10-23/h1-6,11-12,14-15H,7-10,13H2
charge 0 multiplicity 1
44 atoms
Cl -3.688492 -3.948074 1.101287
S  -2.707685 1.898308 -1.438926
N  3.994993 -1.54193 -1.311589
C  2.917462 -0.715923 0.905252
C  2.042997 -0.22926 -0.308008
C  4.341315 -0.115335 0.751336
C  3.024789 -2.265434 0.913397
C  2.714745 -0.844158 -1.611208
C  4.93087 -0.598962 -0.625797
C  3.724835 -2.712964 -0.423164
C  0.59294 -0.623799 -0.205745
C  -0.507879 0.173186 0.00427
C  -1.873442 -0.432739 -0.057142
C  -0.447656 1.64141 0.264321
C  -2.954959 0.248212 -0.681507
C  -1.387783 2.529625 -0.329862
C  -2.12801 -1.715313 0.502244
C  0.518222 2.207471 1.143887
C  -4.233843 -0.344408 -0.78418
C  -1.328513 3.924526 -0.11277
C  -3.401286 -2.293897 0.3823
C  0.588687 3.59791 1.365781
C  -4.467211 -1.633698 -0.259794
C  -0.327802 4.463249 0.723884
H  2.460548 -0.370329 1.851089
H  2.121442 0.873742 -0.347467
H  4.294907 0.989663 0.797169
H  4.975488 -0.45337 1.593128
H  2.022998 -2.722935 1.013949
H  3.613717 -2.585962 1.793439
H  2.9142 -0.045223 -2.347779
H  2.034805 -1.573347 -2.089489
H  5.896439 -1.117777 -0.487347
H  5.106012 0.253745 -1.306432
H  3.095759 -3.426066 -0.986404
H  4.689982 -3.211724 -0.221017
H  0.391087 -1.686789 -0.411821
H  -1.331912 -2.241324 1.036567
H  1.202135 1.538615 1.675276
H  -5.052392 0.199962 -1.265917
H  -2.070207 4.579972 -0.581285
H  1.345684 4.003371 2.045519
H  -5.453739 -2.099188 -0.333615
H  -0.283245 5.544459 0.892473
