program: Gaussian 09
title: 000167179
version: EM64L-G09RevD.01
frameworkgroup: C1[X(C23H14Cl2N6O11S3)]
method: RPBEPBE
basis: SDD
operation: Freq
keyword: #p
keyword: freq=noraman
keyword: PBEPBE/SDD
title: #p freq=noraman PBEPBE/SDD
converged: YES YES NO NO
title: Mulliken charges:
elementType: Cl Cl S S S O O O O O O O O O O O N N N N N N C C C C C C C C C C C C C C C C C C C C C C C H H H H H H H H H H H H H H
charge: 0.058941 0.044768 1.030185 0.997712 1.019482 -0.269077 -0.281451 -0.533055 -0.540105 -0.591500 -0.476768 -0.464084 -0.541067 -0.530812 -0.479607 -0.587880 -0.460050 -0.651243 -0.417553 -0.032860 0.019601 0.129040 0.213905 0.186711 0.400685 0.225883 0.285572 -0.113120 0.407644 -0.187559 -0.404239 -0.439767 -0.267733 -0.385950 0.454244 -0.242998 -0.224942 -0.409221 -0.373466 -0.440868 0.537236 -0.260525 0.137523 -0.274232 -0.232312 0.359209 0.395942 0.307378 0.317925 0.260193 0.366665 0.396916 0.354313 0.269914 0.334259 0.412412 0.396860 0.380570 0.412354
chargesum: 0.00000
title: Mulliken charges with hydrogens summed into heavy atoms:
elementType: Cl Cl S S S O O O O O O O O O O O N N N N N N C C C C C C C C C C C C C C C C C C C C C C C
charge: 0.058941 0.044768 1.030185 0.997712 1.019482 -0.269077 -0.281451 -0.120643 -0.159535 -0.591500 -0.476768 -0.464084 -0.541067 -0.118458 -0.479607 -0.587880 -0.064108 0.112338 -0.020694 -0.032860 0.019601 0.129040 0.213905 0.186711 0.400685 0.225883 0.285572 -0.113120 0.407644 -0.187559 -0.404239 -0.080558 -0.267733 -0.078573 0.454244 0.074928 0.035252 -0.054908 -0.373466 -0.170954 0.537236 0.073734 0.137523 -0.274232 -0.232312
polarizability: 9.87341159e+02 8.92731621e+00 5.49380194e+02 -5.56503825e+00 1.06588832e+01 2.30161283e+02
1716.lowfreq: -3.5655 -2.0051 -0.0015 0.0008 0.0011 2.8822 11.9197 15.6920 20.1131
frequency: 11.8493 15.6684 20.1074 24.1852 37.3479 50.4359 52.3486 60.9997 67.6708 83.9547 91.5900 97.4193 104.9119 109.6733 113.7403 118.2379 130.2162 140.1579 143.5042 148.8878 152.2386 159.9631 168.8793 172.3123 178.3198 186.7108 194.3757 211.2476 218.7430 219.0101 230.3549 236.2659 239.3407 250.0987 258.5485 260.2586 271.5417 273.9954 295.6004 300.8648 304.6505 310.4846 329.4622 333.3724 347.0062 352.9115 379.3521 383.9097 387.7715 394.1875 399.6775 405.8268 414.9486 420.7638 422.4076 436.4186 438.1751 444.8902 454.1697 458.6732 464.4577 496.3868 498.9009 516.5619 522.4698 546.5702 559.1122 570.2457 582.3628 586.6329 602.3300 621.7271 623.3644 647.9703 658.4609 660.6810 669.0138 671.0555 687.1779 692.7707 704.9417 714.0197 715.4375 726.5540 742.0167 768.4048 774.3695 782.3694 786.0303 788.5722 807.7874 812.1593 821.2368 825.2444 837.9494 852.7254 858.1562 870.4133 877.3363 880.4930 882.9925 884.7777 888.2350 898.8923 929.9537 938.6039 945.8949 962.9333 973.3453 974.7663 978.6258 1002.6178 1014.2773 1019.8424 1040.0573 1060.3995 1097.7383 1106.2581 1134.8213 1142.7070 1165.2859 1176.5459 1189.0832 1205.6665 1223.7173 1228.3952 1253.4202 1257.2084 1259.8440 1262.9972 1288.3209 1299.9791 1315.3867 1331.2913 1348.9666 1365.3863 1383.2038 1386.8958 1401.2257 1424.6197 1425.8740 1436.4317 1442.3079 1449.1978 1457.7400 1489.1015 1496.4230 1514.6142 1526.2980 1533.3871 1545.7668 1558.8207 1591.0504 1597.4680 1600.6037 1626.7939 1640.0296 2828.9926 2894.2183 3149.7490 3155.0565 3159.5084 3163.3278 3167.0712 3169.0529 3179.5055 3182.8704 3267.3498 3287.6951 3430.6767 3502.1557
redmass: 12.9937 12.4830 10.6813 15.6874 10.4689 8.8740 12.3587 13.0587 10.9399 10.0351 10.7784 11.7788 10.0452 7.7080 10.5230 12.4150 9.1917 11.6715 12.1373 11.7060 10.6019 12.1978 11.0691 11.1187 7.7777 8.1647 12.3061 7.1441 5.1646 7.7890 11.4752 10.7754 3.9005 10.5283 9.1314 7.3662 4.7393 2.9002 6.8061 4.3836 9.1698 7.1808 9.2490 6.0780 7.8469 8.8292 10.7982 6.0121 13.0487 7.0265 10.8802 7.3896 11.1280 10.6848 11.4568 11.8554 10.7989 6.2890 11.9350 10.4449 4.8819 7.2573 5.2503 6.6154 5.8937 6.7858 11.9128 5.1962 11.9016 9.7351 5.9897 12.0550 5.2683 6.5652 8.8216 5.1146 1.1067 2.8650 8.2687 5.5032 1.8389 4.2143 4.4520 1.1770 3.7267 7.0811 5.9061 6.0891 7.8717 7.7439 3.3327 4.2278 1.9797 5.2388 3.2123 1.2116 1.9962 2.6688 1.3820 6.7449 3.7040 2.0866 5.8863 3.1677 10.6718 11.7541 8.8499 5.4264 1.4578 1.4320 4.0757 1.3696 2.7568 1.3794 2.9415 2.1992 3.0187 1.2663 1.8107 2.4885 3.3915 1.2870 10.5240 1.9284 1.1112 1.6776 3.7252 2.4173 2.0253 1.2745 2.0486 2.6952 3.8369 3.5710 4.4750 3.2447 6.0516 7.6874 7.7133 4.2276 3.8321 3.6675 3.0947 7.5510 5.6392 3.1204 5.9557 5.5671 6.8819 7.6005 4.2130 3.2813 1.6044 2.1901 5.7789 5.1052 6.8647 1.0756 1.0715 1.0891 1.0913 1.0901 1.0917 1.0809 1.0902 1.0985 1.0946 1.0570 1.0797 1.0655 1.0976
irintensity: 0.0811 0.2377 1.2887 0.3245 0.9078 0.5381 1.9227 1.3810 0.4810 5.4386 0.9662 0.8118 0.8437 1.9344 1.4451 2.3139 1.6491 2.8092 2.1716 0.0931 28.4124 15.5540 0.2687 3.2285 1.3712 6.5804 1.0088 6.2759 9.5397 0.0489 1.4356 0.7071 20.7157 3.2174 5.8090 9.3087 12.7828 40.8895 15.8732 14.4598 8.5072 2.4121 3.1668 16.4680 2.9543 23.0828 10.4295 18.3623 21.5149 32.8496 4.1059 20.5360 56.3988 26.3256 92.4423 19.8747 29.0685 13.3397 45.7496 17.2438 9.8861 1.6278 4.0723 1.2389 25.2694 30.2425 71.3088 11.4437 105.0710 61.1030 0.2573 0.0735 11.8671 11.4658 0.4189 9.1836 15.8780 13.2465 18.8147 34.7655 42.4553 17.1232 8.5202 215.3219 5.5501 16.2252 3.0399 128.6784 1.6121 112.1385 147.1447 149.3515 32.6041 76.2255 32.9932 191.0983 33.5800 6.8712 104.6418 66.4690 27.1292 4.8102 3.2404 56.8924 81.6754 122.3193 108.7262 59.7156 36.2913 0.6075 3.7162 1.9771 14.7907 2.7996 22.6916 14.1084 3.8302 39.1844 26.1746 78.0723 83.3890 11.9891 583.1627 6.8906 93.6645 10.0926 82.0198 5.5678 69.8864 101.2052 127.5076 242.3104 632.1881 268.1986 238.1074 63.9739 177.0013 158.8426 35.6665 211.4437 29.3265 6.4628 45.5698 994.4116 19.2051 986.6817 836.6749 114.7608 613.0207 258.0227 50.0841 354.5799 171.8897 590.2591 6.1555 165.2508 86.1898 21.5805 1730.0989 15.7043 1.1380 1.8120 6.3103 67.1791 9.0671 5.0068 33.6211 68.1769 206.4304 45.3904 159.8969
temp: 298.150 k
press: 1.00000 atm
elementType: 17 17 16 16 16 8 8 8 8 8 8 8 8 8 8 8 7 7 7 7 7 7 6 6 6 6 6 6 6 6 6 6 6 6 6 6 6 6 6 6 6 6 6 6 6 1 1 1 1 1 1 1 1 1 1 1 1 1 1
symmnumber: 1
zpe: 944209.0 jmol-1
zpe.correction: 0.359630 hartree
zpe.thermalcorrener: 0.401003 hartree
zpe.thermalcorrenthalpy: 0.401947 hartree
zpe.thermalcorrgfe: 0.284012 hartree
zpe.sumelectzpe: -4151.447517 hartree
zpe.sumelectthermal: -4151.406145 hartree
zpe.sumelectthermalent: -4151.405200 hartree
zpe.sumelectthermalfe: -4151.523135 hartree
dipole: -6.5968 -0.8936 0.8276
dipole: 6.7082
quadrupole: -303.2747 -342.7273 -304.7316
quadrupole: -20.1038 -8.5433 -12.7393
quadrupole: 13.6365 -25.8161 12.1796 -20.1038 -8.5433 -12.7393
hfenergy: -4151.8071472 hartree
pointgroup: C01 [X(C23H14Cl2N6O11S3)]
dipole: -2.5093685 0.7355247 -0.3571999 debye
polarizability: 975.2876821|-70.4551255|554.5314185|31.216744|40.7236932|237.0635351 unknown
InChI: InChI=1S/C23H14Cl2N6O11S3/c24-21-29-22(25)31-23(30-21)28-10-5-4-8(6-13(10)44(37,38)39)27-11-7-14(45(40,41)42)18(26)17-16(11)20(33)15-9(19(17)32)2-1-3-12(15)43(34,35)36/h1-7,27-28,34,37,40H,26H2
charge 0 multiplicity 1
59 atoms
Cl 10.020974 -0.973083 -0.19463
Cl 7.451591 3.056032 2.254528
S  -0.976059 -4.274659 0.358951
S  -4.306284 4.605879 0.116679
S  2.882364 -2.723316 -1.303118
O  -2.484937 2.406679 0.176111
O  -6.021316 -1.804023 -0.203857
O  -0.739056 -4.486513 -1.412231
O  -3.218313 4.606456 -1.387522
O  0.498108 -4.063115 1.039429
O  -1.969181 -5.456535 0.81845
O  -3.481294 4.691305 1.492803
O  -5.377036 5.793957 -0.19322
O  3.010624 -3.668082 0.222465
O  4.324501 -2.855516 -2.016456
O  1.500172 -3.170495 -2.0566
N  -0.459402 0.813972 0.355969
N  -4.092547 -3.53148 0.060367
N  5.040023 -0.572923 -0.361558
N  6.188975 1.139523 0.866835
N  7.352836 -0.691846 -0.237485
N  8.60339 0.982337 0.986765
C  -2.820228 0.02322 0.23008
C  -3.736022 -1.089385 0.146358
C  -4.747076 1.664147 -0.041614
C  -1.415101 -0.202777 0.412918
C  -5.652248 0.564579 -0.148562
C  -3.299117 1.409902 0.12494
C  -3.263748 -2.461121 0.20277
C  -5.166754 -0.844045 -0.069987
C  -1.855082 -2.603895 0.452164
C  -0.990975 -1.546925 0.639034
C  -5.29911 2.96618 -0.113684
C  -7.038525 0.79186 -0.34038
C  0.91177 0.565215 0.108289
C  -6.665036 3.208788 -0.307818
C  -7.541132 2.100219 -0.426301
C  1.298337 -0.579005 -0.633432
C  2.639363 -0.949787 -0.695194
C  1.947255 1.401792 0.605123
C  3.706127 -0.148056 -0.202563
C  3.303685 1.0735 0.422745
C  6.201364 -0.010611 0.112485
C  8.486203 -0.144962 0.22523
C  7.410297 1.55834 1.259036
H  0.034165 -1.760358 0.948941
H  -0.869939 1.773995 0.354667
H  -7.692208 -0.081057 -0.420661
H  -7.030566 4.239544 -0.36341
H  -8.610227 2.27474 -0.57992
H  -3.737642 -4.485143 0.189328
H  -5.091445 -3.312775 -0.10063
H  0.561484 -1.192563 -1.156819
H  1.690883 2.310585 1.159567
H  4.087171 1.725032 0.813666
H  0.172866 -4.075645 -1.679356
H  5.196651 -1.421857 -0.937829
H  -3.39887 5.506405 -1.797949
H  2.059596 -3.934532 0.529994
