program: Gaussian 09
title: 000166531
version: EM64L-G09RevD.01
frameworkgroup: C1[X(C15H15NO3)]
method: RPBEPBE
basis: SDD
operation: Freq
keyword: #p
keyword: freq=noraman
keyword: PBEPBE/SDD
title: #p freq=noraman PBEPBE/SDD
converged: YES YES NO NO
title: Mulliken charges:
elementType: O O O N C C C C C C C C C C C C C C C H H H H H H H H H H H H H H H
charge: -0.330585 -0.420927 -0.213999 -0.572900 -0.544966 0.543983 -0.387706 -0.541587 -0.419740 0.309917 0.161397 -0.350596 0.239899 0.156783 -0.335417 -0.331817 -0.223807 -0.219628 -0.223031 0.229534 0.198257 0.220521 0.203465 0.256551 0.237721 0.218676 0.262348 0.277955 0.268006 0.274042 0.232668 0.231118 0.362005 0.231861
chargesum: 0.00000
title: Mulliken charges with hydrogens summed into heavy atoms:
elementType: O O O N C C C C C C C C C C C C C C C
charge: -0.330585 -0.058922 -0.213999 -0.032596 -0.117175 0.543983 0.036279 -0.285036 -0.182019 0.309917 0.161397 -0.131920 0.239899 0.156783 -0.067411 -0.057775 0.008861 0.011490 0.008830
polarizability: 2.66203217e+02 -8.50341458e+00 1.47275385e+02 -8.42574546e-01 1.23281849e+01 1.38471602e+02
1716.lowfreq: -6.4769 -0.0004 0.0002 0.0005 2.8651 5.9554 23.5946 26.6275 42.8541
frequency: 23.5398 26.5623 42.7242 54.4385 72.5855 90.0088 98.9254 145.3396 158.2227 187.2039 212.1157 237.7769 286.2277 297.2611 304.7449 320.1884 327.6619 377.8682 403.5146 424.9505 435.8321 452.7797 485.0160 530.8662 587.0982 589.4739 602.8230 614.0965 671.4636 679.9310 700.3811 707.5360 750.3077 768.0600 789.3336 794.6478 797.4449 803.9087 864.2077 891.1890 925.1598 933.2190 953.6216 954.7424 990.1762 995.9626 1000.9197 1008.1775 1025.7206 1032.3268 1072.3128 1084.7500 1097.1055 1116.0647 1144.9311 1159.7277 1173.7072 1181.9660 1218.9742 1229.2788 1241.6711 1267.8537 1284.3622 1290.8546 1308.6620 1315.2476 1378.2723 1389.8232 1391.5080 1423.4250 1438.2470 1473.8576 1477.3609 1492.0003 1505.5601 1587.8672 1596.3560 1611.7522 1628.8206 1637.1328 1651.2315 2883.2473 2978.8819 3025.5473 3059.6759 3115.3996 3129.8111 3142.1159 3142.5588 3147.5882 3154.8425 3167.2357 3182.6376 3460.3383 3588.2131 3593.3240
redmass: 4.8544 4.5945 3.4702 5.4077 5.1017 3.6815 2.6679 5.4260 5.2356 4.9306 1.2064 4.0693 3.2850 5.5104 1.3741 3.0096 4.1799 5.0973 2.8276 5.8934 3.7907 3.3830 4.6319 4.3554 5.5173 1.3942 5.2290 6.4387 5.1985 5.9562 1.6393 4.4007 4.9157 4.1980 3.4453 1.2591 2.4996 1.5688 1.2449 1.6818 2.2770 1.5241 2.0531 1.4370 6.3261 1.3878 5.1542 1.3287 1.9975 2.0911 2.5541 1.5810 3.0217 1.4594 1.6553 1.1838 1.0577 1.1358 1.9950 1.5937 2.8855 2.5227 1.3322 1.2613 1.5607 1.3196 1.3658 9.6315 6.0827 3.8424 2.2458 1.0963 2.2870 1.0885 3.1840 6.4683 6.7687 6.0852 7.2635 1.0957 12.2007 1.0711 1.0644 1.0871 1.0998 1.0878 1.0855 1.0949 1.0892 1.0934 1.0942 1.0987 1.0967 1.0449 1.0977 1.0663
irintensity: 0.8613 0.0819 2.5922 2.1895 1.3525 0.9262 5.9276 1.1999 0.4806 1.1543 46.8344 9.0013 17.1918 1.4986 105.6126 22.5652 4.7086 1.1854 0.0126 2.4496 2.3542 7.7167 1.9452 55.5778 0.1617 249.0383 3.8120 1.1655 20.0552 5.4356 79.8256 6.9021 3.7233 17.1557 30.0265 4.4868 21.8416 30.8016 0.0422 15.3426 5.4395 2.5397 7.2651 3.3051 19.3192 0.5359 294.0649 0.4157 10.3961 61.9482 103.0044 10.0719 35.6308 36.0401 205.2855 37.9448 0.4192 64.3066 244.3103 99.0263 86.0831 92.9775 1.5957 15.0731 2.1439 0.4645 18.4676 4.2735 14.5055 8.0174 15.8400 4.3795 4.2527 5.8188 118.5532 12.2364 14.4492 11.7266 5.7235 37.2177 179.7762 98.4910 34.6413 24.7816 32.2462 14.4152 0.2167 19.9447 11.1614 1.7918 18.0759 26.3659 5.9384 0.6677 0.5800 46.9406
temp: 298.150 k
press: 1.00000 atm
elementType: 8 8 8 7 6 6 6 6 6 6 6 6 6 6 6 6 6 6 6 1 1 1 1 1 1 1 1 1 1 1 1 1 1 1
symmnumber: 1
zpe: 700236.4 jmol-1
zpe.correction: 0.266706 hartree
zpe.thermalcorrener: 0.284619 hartree
zpe.thermalcorrenthalpy: 0.285564 hartree
zpe.thermalcorrgfe: 0.218665 hartree
zpe.sumelectzpe: -859.643609 hartree
zpe.sumelectthermal: -859.625695 hartree
zpe.sumelectthermalent: -859.624751 hartree
zpe.sumelectthermalfe: -859.691649 hartree
dipole: 0.1840 -0.1936 -0.5935
dipole: 0.6508
quadrupole: -95.6661 -92.5760 -111.1055
quadrupole: -2.0414 -4.9915 2.4976
quadrupole: 4.1164 7.2065 -11.3229 -2.0414 -4.9915 2.4976
hfenergy: -859.9103146 hartree
pointgroup: C01 [X(C15H15N1O3)]
dipole: -0.0773193 0.0038188 0.2440633 debye
polarizability: 266.7839952|1.650474|138.6755338|-1.6025289|-12.3262867|146.4906755 unknown
InChI: InChI=1S/C15H15NO3/c16-9-8-11-6-7-13(17)14(10-11)19-15(18)12-4-2-1-3-5-12/h1-7,10,17H,8-9,16H2
charge 0 multiplicity 1
34 atoms
O  -0.571271 0.216957 0.422289
O  -0.013409 2.545035 -0.973102
O  -1.010184 -0.263878 -1.83328
N  5.680369 -2.814425 0.442913
C  4.28647 -0.813196 0.925523
C  3.172017 0.095255 0.434953
C  4.567397 -1.98524 -0.054437
C  1.810392 -0.251654 0.630791
C  3.458727 1.287301 -0.275582
C  0.780668 0.563321 0.135688
C  1.073155 1.762724 -0.560026
C  2.425559 2.115631 -0.766341
C  -2.830872 -0.293953 -0.20383
C  -1.425888 -0.11787 -0.666282
C  -3.794444 -0.712578 -1.158727
C  -3.221468 -0.055303 1.139569
C  -5.137759 -0.893809 -0.77267
C  -4.567572 -0.23796 1.520642
C  -5.526588 -0.65744 0.568035
H  5.229444 -0.251878 1.054223
H  4.025582 -1.240019 1.91534
H  4.859757 -1.565888 -1.035437
H  3.613905 -2.544077 -0.217777
H  1.535763 -1.163068 1.173298
H  4.502891 1.576875 -0.440913
H  2.670643 3.042359 -1.301235
H  5.491422 -3.278113 1.337208
H  6.077729 -3.457882 -0.247226
H  -3.469499 -0.88675 -2.189943
H  -2.470856 0.272612 1.863418
H  -5.880024 -1.216989 -1.510421
H  -4.870591 -0.052736 2.556869
H  0.287369 3.291222 -1.547437
H  -6.571236 -0.797687 0.868105
