program: Gaussian 09
title: 000166439
version: EM64L-G09RevD.01
frameworkgroup: C1[X(C11H10ClNO2)]
method: RPBEPBE
basis: SDD
operation: Freq
keyword: #p
keyword: freq=noraman
keyword: PBEPBE/SDD
title: #p freq=noraman PBEPBE/SDD
converged: NO NO NO NO
title: Mulliken charges:
elementType: Cl O O N C C C C C C C C C C C H H H H H H H H H H
charge: -0.061401 -0.189647 -0.206625 -0.157062 -0.374543 -0.563121 0.154956 0.569193 0.178795 -0.603754 -0.347825 -0.450246 -0.095726 -0.196912 -0.245157 0.268767 0.272797 0.281453 0.259683 0.238033 0.254786 0.253637 0.262804 0.236283 0.260836
chargesum: 0.00000
title: Mulliken charges with hydrogens summed into heavy atoms:
elementType: Cl O O N C C C C C C C C C C C
charge: -0.061401 -0.189647 -0.206625 -0.157062 -0.105777 -0.008871 0.154956 0.569193 0.178795 0.167472 -0.088142 -0.212213 -0.095726 0.039370 0.015679
polarizability: 1.62968926e+02 -8.71575234e+00 1.42398680e+02 -6.69156351e+00 5.73949052e-01 9.81808714e+01
1716.lowfreq: -16.5492 -11.9517 -7.7982 -0.0025 -0.0018 -0.0011 3.0580 20.0678 63.0173
frequency: -11.1325 19.6115 62.9310 72.0667 115.1957 147.3626 182.4663 219.9535 250.1460 264.8147 286.9297 322.4758 370.1175 385.2544 436.7438 510.7202 525.5139 544.8558 578.0310 612.8947 631.1956 670.0957 687.1811 697.9235 763.4383 800.3557 827.1679 888.1771 906.4736 937.9779 966.2422 978.8673 985.8336 1033.4383 1051.4118 1076.4470 1093.3551 1110.1577 1128.0075 1154.7270 1179.1023 1209.3756 1226.4558 1261.1726 1267.5341 1273.7436 1315.9562 1349.4321 1382.2799 1427.1722 1431.5246 1447.6515 1467.0599 1470.5839 1482.3483 1580.1607 1609.1185 1635.3545 1700.9065 3007.2023 3028.5925 3035.4809 3089.9084 3101.0949 3125.8897 3136.8996 3147.8441 3157.4649 3180.1041
redmass: 7.9975 4.9884 1.7780 1.7306 7.4323 4.2470 5.5564 4.0582 4.4155 3.3910 4.1935 5.3206 7.4359 11.7283 3.0480 4.5538 5.1419 3.0179 9.8426 4.2081 6.0018 5.8904 4.3476 2.6925 2.6238 1.8753 3.6944 1.5372 1.4098 2.4430 2.3890 1.3703 5.6847 3.3007 6.3536 2.1083 1.6059 2.9070 1.3302 1.2143 1.1070 1.8230 1.3877 2.6658 1.5447 1.5542 1.5506 5.1282 7.1893 2.2553 1.2640 1.1201 2.4473 1.0438 1.0705 6.3857 6.9710 12.0135 11.2848 1.0327 1.0720 1.0737 1.1014 1.1021 1.1024 1.0880 1.0923 1.0935 1.0979
irintensity: 0.1672 0.2532 0.3678 0.1194 10.0780 3.5097 0.4797 0.2047 2.1741 6.5388 1.5229 2.1685 22.5018 8.4214 6.6614 3.1005 1.1722 0.3161 3.3766 1.1567 9.5953 23.1717 15.9964 34.5859 19.9146 27.8069 38.4042 6.1159 1.5252 31.9527 6.7117 0.7060 4.6142 23.0061 18.9112 19.7424 5.3120 118.6104 0.2262 4.7559 1.5492 13.3387 14.8659 86.3885 15.8366 6.5883 2.7975 137.0039 0.5932 28.9166 81.8593 9.8684 32.8471 19.5382 14.1928 42.1722 28.9732 587.7542 34.4288 22.2125 7.6389 5.5868 4.4771 14.1991 0.6856 5.6605 4.2908 11.1127 5.9413
temp: 298.150 k
press: 1.00000 atm
elementType: 17 8 8 7 6 6 6 6 6 6 6 6 6 6 6 1 1 1 1 1 1 1 1 1 1
symmnumber: 1
zpe: 490612.3 jmol-1
zpe.correction: 0.186864 hartree
zpe.thermalcorrener: 0.199689 hartree
zpe.thermalcorrenthalpy: 0.200633 hartree
zpe.thermalcorrgfe: 0.145751 hartree
zpe.sumelectzpe: -1089.384188 hartree
zpe.sumelectthermal: -1089.371363 hartree
zpe.sumelectthermalent: -1089.370419 hartree
zpe.sumelectthermalfe: -1089.425301 hartree
dipole: -0.3151 2.3926 -1.2488
dipole: 2.7172
quadrupole: -92.6129 -95.0893 -99.0336
quadrupole: -1.9746 5.2337 -10.6222
quadrupole: 2.9657 0.4894 -3.4550 -1.9746 5.2337 -10.6222
hfenergy: -1089.5710522 hartree
pointgroup: C01 [X(C11H10Cl1N1O2)]
dipole: -0.2486296 -0.8977457 0.5244672 debye
dipolederiv: -0.2147066 0.1650866 -0.0441483 0.2651477 -0.7125296 0.1470775 -0.0687998 0.1420627 -0.1057409 -0.5404028 -0.1015183 -0.0318898 -0.1938034 -0.574295 -0.26777 -0.0557212 -0.4132606 -0.8620698 -0.8509147 -0.345789 -0.2709973 -0.418956 -0.6496727 -0.3126432 -0.1056237 -0.1757785 -0.6300207 -0.8965648 -0.4321092 -0.1573177 -0.5793981 -0.666225 -0.450825 -0.127804 -0.4616908 -1.0352259 -0.1933147 -0.0368698 0.1834449 -0.1115098 0.1131985 0.0023895 0.2418538 -0.0454708 -0.1252568 -0.2482006 -0.1123367 0.1420018 -0.0682987 0.0139673 0.0327655 0.2389397 0.0238578 -0.1088927 1.1326088 0.579544 0.1836384 0.7238479 0.7968332 0.4894793 -0.2243747 0.4954445 0.9549757 0.4838438 -0.0094686 -0.027295 -0.0838768 0.0676423 -0.0320457 0.0597258 -0.0208975 -0.0655222 0.8966642 0.4376503 0.1291622 0.6068102 0.7074153 0.5536985 0.1946899 0.5813222 1.369909 0.2556725 -0.0341483 -0.1504116 -0.0370973 0.152552 -0.1122272 -0.1396965 -0.0581129 0.219189 -0.2399795 0.1341977 -0.0191252 0.1987047 -0.278194 0.0432383 -0.0508627 0.0475703 -0.1109029 -0.2440025 -0.0316894 0.0052278 -0.0249244 0.0405928 -0.0383263 -0.0116307 -0.0099749 -0.1389273 0.2836739 -0.2531938 0.0751437 -0.4024787 1.0792893 -0.2534007 0.1153293 -0.2490634 0.0108152 0.1131207 0.008973 0.0302154 0.0563021 0.0985167 -0.0346716 0.0248317 -0.0387731 -0.1056362 -0.0536843 0.0116302 0.0173979 0.0534241 -0.3360203 0.0476364 0.0046051 0.0411116 -0.130792 0.0553639 -0.0302396 0.0005116 0.0239309 -0.0742764 0.0277209 -0.0047554 0.0283253 0.052841 0.0251895 0.0055531 -0.060695 -0.002356 0.0621173 0.0818744 -0.0747538 0.0383097 0.0023076 0.059763 0.0509632 0.0605741 0.0526474 -0.0007669 -0.048516 0.0450346 -0.0187221 0.1044293 0.0294336 -0.0778841 -0.0034626 -0.101116 0.0428772 0.010832 0.0055263 0.0072089 0.1329839 0.0736761 0.0805382 -0.0303061 0.0562701 -0.0586506 0.0472349 -0.0233012 0.042492 0.1329163 0.0250929 0.0683861 -0.0654863 0.0234492 0.0682926 0.0697895 0.0042216 0.0757673 -0.0336106 0.0540279 0.0309279 0.0563752 0.1080677 -0.0384185 -0.044742 0.0705117 -0.0110832 0.0525453 0.0425213 -0.0496195 0.0071577 -0.0916373 0.069623 -0.0002654 -0.0774214 -0.0611811 0.1077588 -0.0185346 -0.0872496 -0.0010463 -0.0950444 -0.0198328 0.0228474 -0.0082447 0.0237486 0.1503655 -0.0303469 0.0286655 -0.0286694 0.0418948 0.0959643 0.018849 -0.0322798 0.016788 0.1615615 unknown
polarizability: 164.9381544|5.8962113|140.3691594|6.4020981|-1.8646442|98.2411642 unknown
InChI: InChI=1S/C11H10ClNO2/c1-13-10(14)6-9(11(13)15)7-3-2-4-8(12)5-7/h2-5,9H,6H2,1H3
charge 0 multiplicity 1
25 atoms
Cl -3.109787 2.732677 -0.523479
O  1.187012 -1.472608 -1.762391
O  3.406248 1.370386 1.223109
N  2.473981 0.044362 -0.497251
C  0.593136 -0.941254 0.622733
C  1.355492 -0.008649 1.604715
C  1.406211 -0.856856 -0.695708
C  -0.877841 -0.599063 0.39613
C  2.531074 0.572501 0.816695
C  3.452955 0.368689 -1.541524
C  -1.265041 0.732064 0.090461
C  -1.868307 -1.607162 0.462775
C  -2.622861 1.015069 -0.131111
C  -3.227659 -1.296777 0.235072
C  -3.622559 0.026005 -0.064941
H  0.652863 -1.992275 0.957912
H  1.747206 -0.545599 2.485309
H  0.729792 0.815414 1.986807
H  -0.52324 1.534713 0.019342
H  -1.576208 -2.639059 0.686673
H  2.953683 0.854256 -2.396512
H  3.944076 -0.550828 -1.900664
H  4.19825 1.051086 -1.103624
H  -3.986352 -2.08415 0.289903
H  -4.671127 0.279058 -0.242731
