program: Gaussian 09
title: 000166408
version: EM64L-G09RevD.01
frameworkgroup: C1[X(C14H12N2O5S)]
method: RPBEPBE
basis: SDD
operation: Freq
keyword: #p
keyword: freq=noraman
keyword: PBEPBE/SDD
title: #p freq=noraman PBEPBE/SDD
converged: YES YES NO NO
title: Mulliken charges:
elementType: S O O O O O N N C C C C C C C C C C C C C C H H H H H H H H H H H H
charge: 0.973361 -0.239193 -0.247206 -0.558189 -0.476202 -0.523220 -0.205168 -0.406884 0.222892 0.331068 0.174765 0.147995 0.445745 -0.439561 -0.424644 0.056294 0.062193 -0.350144 -0.360853 -0.278325 -0.609098 -0.653757 0.318189 0.254843 0.285868 0.241920 0.355132 0.253501 0.268425 0.252540 0.248269 0.258048 0.235884 0.385511
chargesum: 0.00000
title: Mulliken charges with hydrogens summed into heavy atoms:
elementType: S O O O O O N N C C C C C C C C C C C C C C
charge: 0.973361 -0.239193 -0.247206 -0.172679 -0.476202 -0.523220 -0.205168 -0.051752 0.222892 0.331068 0.174765 0.147995 0.445745 -0.439561 -0.106456 0.056294 0.062193 -0.095300 -0.074984 -0.036405 0.165368 0.088445
polarizability: 3.25113950e+02 3.01735548e+00 2.68803492e+02 -8.58849845e-01 -1.16977878e+00 1.05900854e+02
1716.lowfreq: -8.4873 -0.0013 -0.0010 0.0005 4.9480 6.3195 28.8439 39.7599 49.1952
frequency: 28.8320 39.7173 49.1869 86.5824 93.8647 106.4181 129.1025 148.0387 159.8650 174.0151 184.5321 221.8591 229.8790 237.4993 255.6079 276.0806 286.0580 293.9018 315.9617 321.1145 328.7170 357.2312 381.1969 390.5606 396.8110 416.2968 443.3791 465.3279 502.6288 510.4175 540.0236 554.7928 591.2098 601.0305 635.1270 673.0065 683.8369 722.3200 763.1657 775.6708 790.9875 802.7176 813.7694 835.7300 873.3908 881.6464 943.1848 951.1889 954.9091 965.4969 1006.4546 1019.0724 1046.6960 1056.0939 1061.4633 1098.5028 1111.7424 1127.0770 1136.6123 1170.0248 1192.5871 1222.8797 1235.9869 1261.2650 1284.0570 1338.1891 1346.3802 1392.3098 1410.5049 1426.3395 1433.7852 1451.9439 1474.0184 1475.9722 1478.0423 1484.4186 1497.2391 1534.2099 1538.2562 1564.2075 1585.3425 1607.1483 1616.7437 1646.7718 2970.6135 3015.8900 3061.3916 3098.6113 3106.0177 3144.0979 3146.6404 3150.7050 3170.4571 3217.7681 3231.6119 3474.8633
redmass: 6.7677 3.7988 7.8462 5.5199 1.4288 2.0833 8.0793 4.0819 6.6271 3.3882 2.5623 8.9108 3.8985 2.9220 3.3458 3.2558 3.0150 1.5862 7.2636 5.0511 6.7005 4.8270 7.8923 9.2448 9.3012 5.6290 8.6783 4.4294 5.8759 7.0564 7.6240 9.3459 4.2351 6.1275 7.0248 6.8026 6.6354 4.7781 6.6654 5.5134 1.5401 6.6880 7.6223 1.2664 5.5007 4.2899 4.8206 8.6864 1.3924 1.5544 1.3724 3.2161 1.2088 3.0781 3.3444 1.8035 1.4591 1.3202 2.0760 1.7507 1.2852 2.8666 2.3200 2.8713 3.7774 4.5299 3.5613 4.0642 2.5312 1.7626 1.5337 2.4525 1.0441 1.1516 1.2600 1.6023 1.2352 4.3159 4.9701 8.7991 7.5283 6.4703 5.4911 1.6114 1.0394 1.0332 1.0951 1.1018 1.1017 1.0921 1.1022 1.0884 1.0958 1.0920 1.0814 1.0661
irintensity: 0.8281 1.1980 0.2629 3.2299 1.5243 1.9368 0.3046 13.8749 6.0639 2.8577 19.2411 4.6145 1.4959 26.5841 11.7254 4.0381 32.0687 3.6834 8.3257 18.8771 6.4725 9.5485 0.4876 33.8010 98.2805 3.5977 13.8972 5.1117 59.3836 7.7038 18.4509 115.4620 9.3643 11.3778 7.2949 5.3712 15.9594 1.8806 9.2128 7.3879 40.7825 32.0452 29.6156 120.0440 14.5365 10.9826 3.4349 57.6201 3.1617 7.7948 1.4232 27.3355 109.0046 74.2186 2.8084 26.6059 7.7874 0.1068 4.7003 0.6926 1.3587 25.2809 1.3111 69.0674 53.7892 225.6862 26.0706 34.6358 111.8778 109.0676 6.2203 13.6504 17.9932 16.0682 7.6387 21.0522 16.4633 4.7770 156.8550 279.5878 447.1145 104.2729 37.9630 170.6804 61.2989 24.8533 19.9533 23.7554 14.6985 13.6633 1.7991 5.2614 4.6184 10.5663 276.0671 51.6187
temp: 298.150 k
press: 1.00000 atm
elementType: 16 8 8 8 8 8 7 7 6 6 6 6 6 6 6 6 6 6 6 6 6 6 1 1 1 1 1 1 1 1 1 1 1 1
symmnumber: 1
zpe: 635844.5 jmol-1
zpe.correction: 0.242180 hartree
zpe.thermalcorrener: 0.262460 hartree
zpe.thermalcorrenthalpy: 0.263404 hartree
zpe.thermalcorrgfe: 0.193315 hartree
zpe.sumelectzpe: -1422.679555 hartree
zpe.sumelectthermal: -1422.659275 hartree
zpe.sumelectthermalent: -1422.658331 hartree
zpe.sumelectthermalfe: -1422.728420 hartree
dipole: 1.9741 6.4292 1.6129
dipole: 6.9162
quadrupole: -144.7989 -125.8750 -137.7765
quadrupole: 10.1999 10.7973 -4.3978
quadrupole: -8.6488 10.2752 -1.6264 10.1999 10.7973 -4.3978
hfenergy: -1422.9217349 hartree
pointgroup: C01 [X(C14H12N2O5S1)]
dipole: -0.924797 2.4522667 -0.7315691 debye
polarizability: 325.2160701|-0.0056176|268.4256058|-3.7092508|-6.0423275|106.17662 unknown
InChI: InChI=1S/C14H12N2O5S/c1-15-12-7-4-3-5-8-11(7)9(6-10(12)22(19,20)21)14(18)16(2)13(8)17/h3-6,15,19H,1-2H3
charge 0 multiplicity 1
34 atoms
S  -3.413189 -1.505795 0.198224
O  1.658741 -3.135466 0.092753
O  4.483944 0.563577 -0.283468
O  -3.634388 -1.692067 -1.638771
O  -3.282537 -2.972709 0.854295
O  -4.592752 -0.499013 0.721967
N  3.060304 -1.284917 -0.111256
N  -2.868178 1.54171 -0.037887
C  0.785784 0.468115 -0.055738
C  -0.351677 1.363692 -0.02904
C  0.617027 -0.951768 0.035138
C  2.111195 1.005257 -0.132181
C  -1.709311 0.804059 0.01721
C  -1.778872 -0.623202 0.149967
C  -0.669088 -1.4838 0.153787
C  1.771722 -1.875973 0.013347
C  3.304323 0.110305 -0.18351
C  -0.088751 2.770199 0.004287
C  2.323081 2.392727 -0.144157
C  1.218786 3.274252 -0.053267
C  4.214294 -2.213283 -0.153089
C  -3.095438 2.895553 -0.559308
H  -0.792525 -2.569492 0.241057
H  -0.906175 3.481869 0.108065
H  3.352482 2.760096 -0.202132
H  1.383179 4.355542 -0.019233
H  -3.728862 1.018296 0.21293
H  4.243289 -2.815676 0.769429
H  5.127072 -1.609296 -0.250619
H  4.10952 -2.901027 -1.007914
H  -4.138742 2.945756 -0.91347
H  -2.435861 3.115141 -1.415689
H  -2.966737 3.68178 0.209564
H  -4.41916 -2.296841 -1.78889
