program: Gaussian 09
title: 000166363
version: EM64L-G09RevD.01
frameworkgroup: C1[X(C14H22O)]
method: RPBEPBE
basis: SDD
operation: Freq
keyword: #pfreq=noraman
keyword: PBEPBE/SDD
title: #p freq=noraman PBEPBE/SDD
converged: YES YES NO NO
title: Mulliken charges:
elementType: O C C C C C C C C C C C C C C H H H H H H H H H H H H H H H H H H H H H H
charge: -0.189971 0.200822 0.210576 0.210191 -0.568996 0.205623 -0.432921 -0.505703 -0.457529 -0.637086 0.116577 -0.753538 -0.744173 -0.739919 -0.744883 0.232275 0.213948 0.198542 0.198011 0.219900 0.211108 0.208371 0.206075 0.237408 0.253776 0.221713 0.220512 0.214355 0.209285 0.215693 0.225368 0.226318 0.215879 0.240199 0.201321 0.234775 0.226097
chargesum: 0.00000
title: Mulliken charges with hydrogens summed into heavy atoms:
elementType: O C C C C C C C C C C C C C C
charge: -0.189971 0.200822 0.210576 0.210191 -0.122773 0.205623 -0.036368 -0.074695 -0.043083 -0.145901 0.116577 -0.096958 -0.093827 -0.057524 -0.082689
polarizability: 1.62769401e+02 -1.22877942e+00 1.53911884e+02 3.56846102e+00 5.13069084e-01 1.20043758e+02
1716.lowfreq: -15.1196 -5.5749 -0.0008 -0.0004 0.0003 7.8384 52.4017 57.2672 104.6136
frequency: 52.2831 57.1807 104.5707 123.9057 178.9436 184.2811 203.6504 215.9517 235.8962 243.3493 251.6448 256.2048 297.4817 299.7396 322.8624 342.6900 355.4798 364.1716 385.5670 421.9007 451.2932 473.3045 495.2745 552.0683 570.3452 611.7970 643.5505 678.1739 697.4437 792.2958 840.6098 849.7372 878.3367 898.4090 917.9044 919.0976 923.9748 943.2644 945.5260 971.7754 990.4777 999.4930 1027.9065 1032.6796 1063.5765 1096.2461 1117.7483 1126.3933 1132.4408 1156.1450 1171.0660 1181.4553 1198.7193 1205.7859 1213.4063 1221.9137 1262.2882 1267.3726 1280.7628 1309.8188 1332.8744 1339.8332 1343.5459 1360.0485 1371.9818 1373.5835 1391.9672 1393.0659 1425.0665 1446.3267 1453.6862 1458.0529 1463.2193 1464.7676 1465.7560 1474.1996 1476.2649 1478.2564 1480.5481 1485.5029 1489.4300 1621.4548 1685.8100 2930.2943 2940.6564 2951.2683 2966.3806 2970.3678 2974.7628 2977.3708 2979.6089 2984.8719 2994.7653 3000.9206 3004.0399 3025.7796 3044.2551 3061.4726 3066.7593 3071.2027 3075.0239 3079.6260 3080.5033 3086.6626 3093.3566
redmass: 4.2913 3.2775 2.9021 2.2943 1.4068 1.1358 1.6907 1.7537 1.3134 1.6989 1.4930 1.6722 2.5784 2.4577 3.8254 2.0620 2.7646 2.3782 2.3625 3.0448 2.8088 3.0994 3.1394 2.8377 3.3131 3.2006 3.6057 3.4367 3.1725 2.3533 1.5451 2.4791 2.2324 1.7748 2.0819 2.2536 1.5911 1.6170 1.7031 1.8729 1.3494 1.3407 1.8603 1.7969 2.2633 1.7827 1.8160 1.8577 2.0597 1.6417 2.0329 1.7620 2.1963 2.4037 1.9463 2.0845 1.5628 1.8152 1.8558 1.8801 1.4798 1.6510 1.6372 1.9187 1.1903 1.2194 1.2079 1.2120 1.0772 1.0744 1.0890 1.0602 1.0576 1.0605 1.0548 1.0680 1.0669 1.0606 1.0606 1.0667 1.0654 10.4894 7.6436 1.0664 1.0622 1.0607 1.0578 1.0353 1.0384 1.0348 1.0809 1.0365 1.0777 1.0973 1.0894 1.0989 1.1029 1.0995 1.0989 1.0996 1.0994 1.0986 1.0994 1.1000 1.0989
irintensity: 3.0709 0.5183 1.0748 0.5422 0.5802 0.2957 0.1381 0.5211 0.5036 0.4970 0.4946 0.3053 0.9899 0.1222 3.2512 5.0318 1.3680 0.5390 2.0777 1.0967 0.2546 1.3878 2.1711 0.4554 2.5363 1.8507 1.6901 0.1503 2.4694 1.0804 3.8961 5.9736 2.9314 3.4833 5.2408 3.0145 0.9856 0.2432 6.7550 0.6125 1.0979 1.2302 8.2221 2.3246 5.7732 16.4679 3.8971 2.1347 14.4600 3.6630 5.8303 14.5694 2.2326 8.9278 2.8102 5.1770 5.4884 6.2749 11.4712 2.8371 6.9862 0.5640 3.2531 3.2503 13.1222 23.8490 17.2101 21.9273 13.6871 1.1923 5.9142 3.8875 4.1305 2.5051 1.2056 12.1706 9.4522 11.0342 20.3578 15.5841 6.1561 170.8481 0.0526 15.4081 55.7195 27.9940 28.4556 24.1891 49.8078 25.1339 19.2411 30.8723 52.3960 17.1178 12.8632 48.5558 59.5689 10.7613 78.5383 11.5663 26.6840 36.2895 45.8510 22.6495 32.3583
temp: 298.150 k
press: 1.00000 atm
elementType: 8 6 6 6 6 6 6 6 6 6 6 6 6 6 6 1 1 1 1 1 1 1 1 1 1 1 1 1 1 1 1 1 1 1 1 1 1
symmnumber: 1
zpe: 853193.5 jmol-1
zpe.correction: 0.324964 hartree
zpe.thermalcorrener: 0.340834 hartree
zpe.thermalcorrenthalpy: 0.341778 hartree
zpe.thermalcorrgfe: 0.283592 hartree
zpe.sumelectzpe: -620.735199 hartree
zpe.sumelectthermal: -620.719329 hartree
zpe.sumelectthermalent: -620.718385 hartree
zpe.sumelectthermalfe: -620.776571 hartree
dipole: 3.0900 -0.9710 1.4663
dipole: 3.5554
quadrupole: -103.7639 -90.6533 -93.5921
quadrupole: 6.0679 -5.9858 2.1156
quadrupole: -7.7608 5.3498 2.4110 6.0679 -5.9858 2.1156
hfenergy: -621.0601629 hartree
pointgroup: C01 [X(C14H22O1)]
dipole: -1.2191006 -0.3701857 -0.5774366 debye
polarizability: 162.774884|1.1384098|153.8555909|3.7274413|-0.9932988|120.0945681 unknown
InChI: InChI=1S/C14H22O/c1-13(2)7-5-6-10-8-12(15)14(3,4)9-11(10)13/h5-9H2,1-4H3
charge 0 multiplicity 1
37 atoms
O  3.276732 1.139284 0.893388
C  -1.939858 -0.85966 0.169756
C  -0.530091 -0.226714 0.162732
C  2.016343 -0.660694 -0.215378
C  0.650071 -1.180671 0.334076
C  -0.326391 1.118401 0.03094
C  -3.032962 0.235585 0.352554
C  -1.44927 2.130915 -0.151306
C  -2.791086 1.473945 -0.531602
C  1.063733 1.738279 0.083662
C  2.220069 0.76768 0.315665
C  -2.073437 -1.867896 1.349389
C  -2.182209 -1.625541 -1.167293
C  1.969926 -0.595786 -1.773316
C  3.164268 -1.585976 0.239064
H  0.773375 -1.428403 1.409763
H  0.436617 -2.144985 -0.169875
H  -3.045637 0.554347 1.41522
H  -4.02448 -0.210149 0.138683
H  -1.568126 2.712511 0.788878
H  -1.151165 2.872109 -0.921887
H  -3.618235 2.199703 -0.414532
H  -2.774035 1.180228 -1.599193
H  1.268036 2.274876 -0.871187
H  1.117088 2.52116 0.866724
H  -1.397428 -2.733879 1.23502
H  -1.849428 -1.380893 2.316666
H  -3.108586 -2.256404 1.394537
H  -1.396226 -2.380432 -1.352743
H  -3.153773 -2.154498 -1.13402
H  -2.193426 -0.935341 -2.029498
H  2.906437 -0.171948 -2.179119
H  1.855608 -1.619279 -2.176968
H  1.119672 0.008559 -2.133854
H  2.985131 -2.61825 -0.11546
H  4.133369 -1.239565 -0.1590
H  3.250974 -1.601221 1.339913
