program: Gaussian 09
title: 000166371
version: EM64L-G09RevD.01
frameworkgroup: C1[X(C15H30O2)]
method: RPBEPBE
basis: SDD
operation: Freq
keyword: #pfreq=noraman
keyword: PBEPBE/SDD
title: #p freq=noraman PBEPBE/SDD
converged: YES YES NO NO
title: Mulliken charges:
elementType: O O C C C C C C C C C C C C C C C H H H H H H H H H H H H H H H H H H H H H H H H H H H H H H
charge: -0.269610 -0.249310 -0.383641 -0.381333 -0.372520 -0.372111 -0.363647 -0.353595 -0.407841 -0.356313 -0.286623 -0.054603 -0.507282 -0.696592 0.268289 -0.691469 -0.691574 0.192926 0.193578 0.191550 0.192137 0.188403 0.192812 0.190037 0.189040 0.188345 0.217738 0.187912 0.187477 0.196872 0.214834 0.194612 0.195008 0.228095 0.225058 0.208921 0.232348 0.223319 0.215122 0.209694 0.209616 0.211144 0.214888 0.219783 0.210037 0.204494 0.243980
chargesum: 0.00000
title: Mulliken charges with hydrogens summed into heavy atoms:
elementType: O O C C C C C C C C C C C C C C C
charge: -0.269610 -0.249310 0.002862 0.002353 0.008694 0.006966 0.042437 0.021795 0.003865 0.033306 0.166530 0.154318 -0.051616 -0.062160 0.268289 -0.045654 -0.033063
polarizability: 2.07118318e+02 1.71164024e+00 1.65087143e+02 -3.91680932e+00 3.77058161e-01 1.39996340e+02
1716.lowfreq: -5.9821 -1.0614 -0.0008 0.0007 0.0014 8.0927 13.0096 24.6991 27.0430
frequency: 12.8358 23.6773 25.9921 29.0761 42.0966 48.6538 68.0888 73.0918 93.1040 110.1783 119.9673 133.0055 146.5841 152.5664 172.0781 192.5976 209.0234 225.3377 226.3384 241.5439 244.4128 291.7459 321.8718 358.3446 359.5390 416.2305 433.4637 461.2413 467.0562 511.3661 579.8643 718.4792 721.8523 728.4530 736.0222 751.1853 784.8721 791.8015 831.3399 865.7512 886.6104 890.6215 900.3699 912.4589 929.0737 954.3343 964.5336 968.2265 986.1888 1007.4632 1014.4892 1028.3620 1057.6287 1063.2540 1071.8698 1078.4898 1079.4869 1089.5918 1105.4513 1123.5167 1145.9295 1168.5284 1184.4571 1189.4995 1196.9682 1214.9611 1225.3975 1246.1132 1249.6891 1257.1527 1268.5249 1275.9562 1279.7305 1285.3738 1288.8875 1294.6468 1296.5666 1320.5741 1328.7318 1342.9407 1345.6864 1353.7638 1355.6119 1361.9580 1364.8961 1384.9050 1390.0636 1402.4633 1450.4457 1451.7098 1459.6443 1459.9285 1463.4385 1465.5490 1467.0888 1470.7509 1473.2081 1476.4399 1476.5549 1479.6007 1484.1326 1484.9566 1486.1966 1488.6499 1630.5021 2948.6083 2949.5584 2950.7212 2954.1248 2959.9626 2964.5955 2967.7743 2971.5055 2972.0753 2974.1012 2977.4568 2980.4153 2981.9436 2987.4262 2996.4092 3001.6922 3008.4436 3015.5616 3019.9393 3028.2626 3038.5073 3049.5960 3067.8210 3068.8528 3069.2036 3069.8403 3070.3562 3075.7325 3085.9361 3087.0564
redmass: 3.7959 3.3337 1.9948 3.2060 3.6255 3.7039 1.9773 2.0958 2.8267 2.3569 2.5718 2.2019 2.8865 2.1568 4.5376 2.7933 1.2173 1.5238 1.7457 1.4374 1.5532 3.8574 2.9283 2.2356 2.6770 2.3356 2.9673 2.8228 2.7351 2.8548 4.6228 1.0602 1.1069 1.3163 2.7799 1.3249 2.5865 1.7356 1.6310 1.6981 1.7562 1.7433 1.9006 1.8674 1.2878 1.3993 1.8511 1.6886 4.7489 1.7856 1.6470 2.9080 2.3702 2.0536 2.4739 2.2818 2.0631 2.0677 1.4954 2.7707 1.7915 2.5238 1.7426 2.1793 1.2560 1.4189 1.3125 1.2713 1.3173 1.2785 1.5148 1.0414 1.1987 1.1326 1.1605 1.1426 1.1174 1.3555 1.5120 1.3546 1.4321 1.7143 1.6197 1.4685 1.6584 1.2110 1.2173 1.2166 1.0828 1.0969 1.0716 1.0731 1.0663 1.0457 1.0779 1.0591 1.0799 1.0794 1.0443 1.0843 1.0476 1.0866 1.0575 1.0911 9.5735 1.0585 1.0586 1.0592 1.0594 1.0598 1.0616 1.0586 1.0367 1.0784 1.0364 1.0612 1.0395 1.0959 1.0972 1.0994 1.0597 1.1009 1.0603 1.1000 1.1027 1.1043 1.1033 1.1006 1.1062 1.1008 1.0993 1.1002 1.0995 1.1018 1.1005
irintensity: 0.0443 0.4585 0.0300 1.1382 0.7152 0.0729 0.1785 0.2406 0.0428 0.1844 0.0982 0.0643 0.2069 0.1202 2.5412 3.1417 1.0077 0.7293 1.0615 2.3179 1.9768 5.4327 0.0527 0.5451 0.0954 1.7331 0.6858 1.3454 0.0833 2.8315 5.0253 15.9213 0.3088 3.1250 6.5289 1.6191 0.3502 2.0095 5.9845 0.0367 4.2157 5.5482 11.0567 14.1311 9.0270 5.0508 18.7209 0.7911 5.0976 7.0263 0.5662 6.2658 9.0577 139.4698 14.3497 2.5081 0.1696 7.3698 2.1721 10.4704 1.7251 193.7314 0.8226 38.8497 9.8588 2.6734 0.9734 34.4416 0.4718 1.3455 53.2823 0.2287 0.7816 0.4582 1.0325 0.4176 0.9468 0.5506 1.1265 7.6900 4.9095 0.2952 2.1104 3.4860 1.0750 25.5793 11.1306 15.6350 5.6059 7.6083 0.0651 0.3263 0.2255 1.6204 0.1907 7.0679 2.1327 13.3028 10.7306 2.5840 22.0703 10.5455 11.7238 28.0820 185.2756 0.8257 0.1383 2.3611 0.3799 23.9971 34.0133 175.4519 36.8521 23.6590 36.0012 49.7131 25.9287 1.2640 2.5385 2.3854 27.0448 3.9762 22.0343 2.2865 2.5639 95.9466 146.7578 93.6101 40.1261 34.2772 54.8650 23.3587 56.1580 32.9626 35.1839
temp: 298.150 k
press: 1.00000 atm
elementType: 8 8 6 6 6 6 6 6 6 6 6 6 6 6 6 6 6 1 1 1 1 1 1 1 1 1 1 1 1 1 1 1 1 1 1 1 1 1 1 1 1 1 1 1 1 1 1
symmnumber: 1
zpe: 1108429.9 jmol-1
zpe.correction: 0.422179 hartree
zpe.thermalcorrener: 0.444716 hartree
zpe.thermalcorrenthalpy: 0.445660 hartree
zpe.thermalcorrgfe: 0.365705 hartree
zpe.sumelectzpe: -738.636215 hartree
zpe.sumelectthermal: -738.613678 hartree
zpe.sumelectthermalent: -738.612734 hartree
zpe.sumelectthermalfe: -738.692689 hartree
dipole: -1.7637 0.3653 1.0275
dipole: 2.0736
quadrupole: -123.9043 -103.3274 -108.5218
quadrupole: 6.1516 8.7057 1.3013
quadrupole: -11.9865 8.5905 3.3960 6.1516 8.7057 1.3013
hfenergy: -739.0583938 hartree
pointgroup: C01 [X(C15H30O2)]
dipole: 0.6927369 -0.1393963 0.4077354 debye
polarizability: 207.0877978|1.79691|165.0829446|4.1227776|-0.5830298|140.031058 unknown
InChI: InChI=1S/C15H30O2/c1-4-5-6-7-8-9-10-11-12-17-15(16)13-14(2)3/h14H,4-13H2,1-3H3
charge 0 multiplicity 1
47 atoms
O  -3.07465 0.984931 0.537879
O  -4.992532 0.785774 -0.770137
C  2.228661 0.462748 -0.329665
C  3.683189 0.715984 0.126247
C  1.252461 1.589518 0.076921
C  4.657174 -0.412192 -0.282409
C  -0.206932 1.308627 -0.34395
C  6.107645 -0.174622 0.194579
C  -1.180656 2.437495 0.060957
C  7.080083 -1.303328 -0.217981
C  -2.638112 2.145632 -0.299844
C  -4.318551 -2.179958 0.411197
C  -4.592281 -0.796983 1.093318
C  8.525101 -1.064727 0.270795
C  -4.289087 0.382627 0.187562
C  -2.846413 -2.310521 -0.046006
C  -5.299529 -2.459833 -0.751008
H  1.873539 -0.498308 0.098151
H  2.205953 0.337815 -1.432606
H  3.70485 0.835891 1.229861
H  4.039667 1.678554 -0.2971
H  1.591059 2.547469 -0.371413
H  1.294469 1.729651 1.177537
H  4.647858 -0.521985 -1.387254
H  4.290778 -1.376904 0.127684
H  -0.251337 1.162922 -1.443886
H  -0.547693 0.359738 0.114601
H  6.47627 0.79078 -0.211766
H  6.118383 -0.069667 1.299917
H  -0.889511 3.381747 -0.443508
H  -1.109002 2.622954 1.15068
H  6.707438 -2.268284 0.182896
H  7.073136 -1.403368 -1.322793
H  -3.307118 2.996181 -0.073152
H  -2.764937 1.878648 -1.3654
H  -4.498943 -2.936861 1.202806
H  -3.979758 -0.711438 2.007019
H  -5.661044 -0.744473 1.371034
H  9.198925 -1.885609 -0.03689
H  8.932402 -0.121385 -0.140033
H  8.562821 -0.992181 1.374298
H  -2.642734 -3.335761 -0.40579
H  -2.144653 -2.087194 0.778691
H  -2.624431 -1.612879 -0.875273
H  -6.349584 -2.431279 -0.405456
H  -5.108499 -3.45878 -1.185316
H  -5.193273 -1.706268 -1.551195
