program: Gaussian 09
title: 000166372
version: EM64L-G09RevD.01
frameworkgroup: C1[X(C13H20O4)]
method: RPBEPBE
basis: SDD
operation: Freq
keyword: #pfreq=noraman
keyword: PBEPBE/SDD
title: #p freq=noraman PBEPBE/SDD
converged: YES YES NO NO
title: Mulliken charges:
elementType: O O O O C C C C C C C C C C C C C H H H H H H H H H H H H H H H H H H H H
charge: -0.272470 -0.219045 -0.253511 -0.247886 0.439867 -0.546539 -0.106608 -0.525856 -0.552342 0.503277 -0.426834 -0.741761 -0.740939 -0.566123 -0.323479 -0.001739 0.035112 0.260332 0.222180 0.254760 0.242562 0.216279 0.209766 0.262621 0.211306 0.216236 0.214054 0.236487 0.236393 0.219901 0.205629 0.232514 0.205551 0.230402 0.248868 0.211492 0.209543
chargesum: 0.00000
title: Mulliken charges with hydrogens summed into heavy atoms:
elementType: O O O O C C C C C C C C C C C C C
charge: -0.272470 -0.219045 -0.253511 -0.247886 0.439867 -0.064027 0.148152 -0.067015 -0.079954 0.503277 -0.215528 -0.074984 -0.079015 -0.128058 0.155791 0.209753 0.244654
polarizability: 1.61930696e+02 4.22727272e+00 1.40627896e+02 -4.95379833e+00 2.01092456e+00 1.34848949e+02
1716.lowfreq: -6.9713 -0.0006 -0.0005 0.0004 3.5540 15.8850 42.5174 53.2826 65.8563
frequency: 42.4797 53.2590 65.8420 75.2645 83.6011 100.0607 137.9151 162.7549 170.6627 198.8419 215.7179 221.8925 239.5095 249.8697 266.0661 288.4741 299.2930 323.5611 337.4089 362.3359 384.3956 417.4502 435.4424 459.5127 481.7179 540.8312 563.8365 626.2527 660.4210 707.4106 743.0845 754.3253 768.3350 802.0313 820.0006 879.3844 913.0893 921.6687 939.7030 943.6109 952.0360 953.9357 959.5751 961.7039 983.5727 1012.5703 1045.6606 1057.0747 1084.8873 1089.2077 1097.7672 1109.8572 1140.3269 1154.4814 1165.7618 1186.2771 1204.4948 1214.7493 1238.2990 1242.0658 1254.1419 1308.8698 1322.1837 1333.0344 1341.3177 1345.9613 1348.7618 1351.4733 1356.4388 1363.4433 1379.4869 1385.9817 1397.9765 1440.9927 1448.2919 1458.3514 1460.8958 1467.6763 1471.7387 1475.5390 1486.9241 1492.4228 1603.6847 1621.6299 1692.7245 2961.5285 2965.6705 2975.3810 2977.3922 2980.8393 2996.4752 3004.6660 3014.4497 3029.9839 3030.2529 3039.5329 3046.3605 3048.8425 3064.8809 3072.5331 3078.5890 3084.5037 3087.7761 3097.1908 3106.2386
redmass: 5.0786 6.0198 5.6860 3.0866 9.4442 4.8321 4.1740 3.7078 3.4868 2.8850 1.8265 1.4030 2.2370 1.3223 2.9782 3.0182 2.7322 2.3016 2.5417 2.2025 2.4069 2.9179 2.7705 3.4526 2.6572 3.1892 3.1928 2.9547 3.4483 5.6673 3.7928 4.7618 3.2870 1.5695 1.6555 2.5030 2.2816 1.2532 1.9465 1.8842 1.7338 1.5993 1.6698 1.6480 2.2942 2.4341 1.9152 2.2475 2.1626 5.6803 6.4527 2.2357 2.3436 1.4082 1.8185 1.7431 1.4317 1.5147 1.3211 1.2406 1.6230 1.3318 1.3872 1.3523 1.3075 1.5967 1.1852 1.3213 1.2363 1.5763 1.2086 1.6368 1.2044 1.0882 1.1025 1.0874 1.0971 1.0850 1.0482 1.0515 1.0483 1.0530 8.3228 7.6473 6.9584 1.0631 1.0608 1.0598 1.0364 1.0398 1.0762 1.0831 1.0861 1.0904 1.0677 1.0906 1.0913 1.0913 1.0989 1.0980 1.0989 1.0995 1.0987 1.0909 1.1088
irintensity: 0.0757 0.1006 0.1925 0.6371 1.9075 3.4853 1.2850 1.9484 0.9894 6.0188 8.0146 4.6520 2.5777 3.5993 1.9278 17.1387 12.0728 0.8049 9.8856 5.8211 7.5055 2.0330 8.9284 6.1875 10.8194 7.8025 10.3344 1.7088 4.2692 4.7089 1.8197 4.7661 8.0347 1.2239 26.6282 5.7687 2.4149 6.2209 0.5323 2.3162 3.5415 1.8780 1.8543 3.6940 16.9357 28.8576 4.1072 22.3633 43.5208 53.7259 318.7552 41.1020 5.2986 3.9140 7.2543 2.4194 1.3401 6.0577 6.2117 17.8285 1.9952 6.3542 3.2569 1.0065 0.2860 3.0211 13.1557 4.0127 4.8665 2.3489 23.4646 3.5671 23.7786 8.4168 12.7548 17.4806 30.0348 1.7414 1.1292 3.3569 8.8459 20.2843 278.7633 183.3504 1.1989 14.5342 55.9676 12.1549 23.9880 45.3644 13.7527 1.2873 33.4943 12.7551 35.1411 39.5537 36.0778 33.5851 2.1083 70.1964 24.8641 22.0795 33.1366 27.8951 22.5057
temp: 298.150 k
press: 1.00000 atm
elementType: 8 8 8 8 6 6 6 6 6 6 6 6 6 6 6 6 6 1 1 1 1 1 1 1 1 1 1 1 1 1 1 1 1 1 1 1 1
symmnumber: 1
zpe: 812172.6 jmol-1
zpe.correction: 0.309340 hartree
zpe.thermalcorrener: 0.327441 hartree
zpe.thermalcorrenthalpy: 0.328386 hartree
zpe.thermalcorrgfe: 0.263741 hartree
zpe.sumelectzpe: -806.926265 hartree
zpe.sumelectthermal: -806.908164 hartree
zpe.sumelectthermalent: -806.907220 hartree
zpe.sumelectthermalfe: -806.971865 hartree
dipole: -1.0470 -3.4044 -1.2883
dipole: 3.7876
quadrupole: -94.8994 -106.6375 -101.5010
quadrupole: -0.9791 -4.9061 -8.1179
quadrupole: 6.1133 -5.6249 -0.4884 -0.9791 -4.9061 -8.1179
hfenergy: -807.2356054 hartree
pointgroup: C01 [X(C13H20O4)]
dipole: 0.3471278 -1.382438 0.4346076 debye
polarizability: 161.1365212|-5.1702099|141.3102395|-5.9174132|-1.3103114|134.9607797 unknown
InChI: InChI=1S/C13H20O4/c1-11(2)13(17-10-15)6-3-12(4-7-13)5-8-16-9-14/h3,9-11H,4-8H2,1-2H3
charge 0 multiplicity 1
37 atoms
O  -0.83393 1.073788 0.534303
O  3.544844 -0.069576 0.787138
O  -1.488754 2.497394 -1.23052
O  2.337005 1.82215 0.0832
C  -1.586433 -0.175084 0.054196
C  -1.129102 -0.52622 -1.382107
C  -3.118308 0.116804 0.163808
C  -1.077781 -1.244688 1.04473
C  0.408104 -0.604272 -1.499551
C  1.032519 -1.422047 -0.378965
C  0.336104 -1.713789 0.753615
C  -3.549934 0.466788 1.608577
C  -3.984323 -1.043306 -0.389705
C  2.475278 -1.866461 -0.555787
C  3.487951 -0.70053 -0.56885
C  -0.844841 2.250859 -0.187097
C  2.904471 1.14525 0.964505
H  -1.53695 0.203449 -2.101594
H  -1.555596 -1.518919 -1.621036
H  -3.302966 1.000939 -0.47705
H  -1.118299 -0.825787 2.068051
H  -1.773987 -2.108055 1.037647
H  0.674143 -1.047161 -2.481251
H  0.842387 0.416127 -1.496261
H  0.820074 -2.309939 1.540872
H  -3.496932 -0.415567 2.273657
H  -4.596156 0.823213 1.613834
H  -2.916182 1.260982 2.040528
H  -3.793928 -1.232272 -1.460319
H  -5.053951 -0.78535 -0.283462
H  -3.816829 -1.986313 0.164553
H  2.76545 -2.570297 0.24609
H  2.599759 -2.400252 -1.522235
H  4.512401 -1.067229 -0.743025
H  3.228979 0.073731 -1.311579
H  -0.169501 2.96421 0.322668
H  2.995213 1.427532 2.029621
